program: Orca
programVersion: 5.0.2
elementType: F F F O O O O O N C C C C C C C C C C C C C C C C C C C C C C H H H H H H H H H H H H H H H H H H H H
charge: 0
multiplicity: 1
keywords: wb97x-d3
keywords: def2-TZVPP
keywords: def2/J RIJCOSX
keywords: DEFGRID2
keywords: scfconv7
keywords: smallprint printgap noloewdin
keywords: NOSOSCF
formula: C22H20F3NO5
InChI: InChI=1/C22H20F3NO5/c1-5-17-13(3)20(30-21(27)28-4)16-11-19(12(2)10-18(16)26-17)29-14-6-8-15(9-7-14)31-22(23,24)25/h6-11H,5H2,1-4H3
51 atoms
F  5.959399 -1.074749 1.896201
F  6.561672 -1.273009 -0.14709
F  7.220043 0.4255 1.000376
O  -1.809394 2.128905 0.16278
O  0.484473 -2.387671 -0.584319
O  -0.567521 3.485016 -0.925984
O  5.15221 0.365108 0.40006
O  -2.141249 2.338016 -2.057469
N  -4.667925 -0.839215 0.527096
C  -2.376699 -0.188685 0.103026
C  -3.384771 -1.161744 0.254226
C  -4.080674 1.49523 0.519565
C  -5.009576 0.416893 0.653155
C  -2.786464 1.153306 0.246364
C  -1.051253 -0.583964 -0.173859
C  -1.754952 -2.920338 -0.149828
C  -3.037313 -2.522876 0.116799
C  -0.761478 -1.915874 -0.290203
C  -6.463106 0.69575 0.908582
C  -4.525989 2.914786 0.687323
C  -1.390953 -4.365081 -0.288667
C  -7.241906 0.892839 -0.391188
C  1.601016 -1.636425 -0.324882
C  1.873897 -1.168284 0.95412
C  2.487903 -1.420534 -1.366963
C  -1.553337 2.631873 -1.052252
C  3.061042 -0.497562 1.193774
C  3.682709 -0.759007 -1.125463
C  3.957006 -0.313732 0.154032
C  -0.12515 4.139893 -2.121261
C  6.19912 -0.385628 0.78009
H  -0.272249 0.15874 -0.287254
H  -3.81715 -3.265228 0.234283
H  -6.884315 -0.149304 1.453866
H  -6.583788 1.573938 1.543914
H  -4.937439 3.076499 1.684585
H  -3.71841 3.629807 0.552886
H  -5.309544 3.168415 -0.027205
H  -0.988808 -4.587941 -1.278198
H  -0.634226 -4.661964 0.439248
H  -2.265418 -4.994705 -0.135828
H  -8.293389 1.08686 -0.179022
H  -6.861089 1.734411 -0.970606
H  -7.187567 0.003768 -1.019633
H  1.176433 -1.332142 1.765266
H  2.257534 -1.781554 -2.360598
H  3.281152 -0.124572 2.185148
H  4.380934 -0.587222 -1.933646
H  -0.925841 4.727304 -2.567886
H  0.255009 3.419182 -2.843909
H  0.679081 4.800431 -1.813314
elementType: F O N C H
totalener: -1581.01202657 hartree
nucrepener: 3061.26206483 hartree
electener: -4642.27409139 hartree
oneelecener: -8252.14645270 hartree
twoeener: 3609.87236131 hartree
cpcmener: -0.03473914 hartree
kineticenergy: 1574.75322621 hartree
xcener: -144.853340309844 hartree
chargesum: -0.0000000
charge: -0.173928 -0.174360 -0.165527 -0.321462 -0.338143 -0.290276 -0.314258 -0.467741 -0.350508 -0.031138 0.097403 -0.030741 0.200424 0.222984 -0.135730 -0.076208 -0.187184 0.250824 -0.145556 -0.258145 -0.238274 -0.271378 0.283555 -0.193631 -0.228434 0.587718 -0.143524 -0.133280 0.192715 -0.123382 0.591247 0.157889 0.114480 0.078882 0.086558 0.116310 0.099245 0.116610 0.104265 0.103123 0.098683 0.096026 0.089458 0.087080 0.162817 0.152765 0.159422 0.159138 0.125886 0.124924 0.132379
qa: -0.1739 -0.1744 -0.1655 -0.3215 -0.3381 -0.2903 -0.3143 -0.4677 -0.3505 -0.0311 0.0974 -0.0307 0.2004 0.2230 -0.1357 -0.0762 -0.1872 0.2508 -0.1456 -0.2581 -0.2383 -0.2714 0.2836 -0.1936 -0.2284 0.5877 -0.1435 -0.1333 0.1927 -0.1234 0.5912 0.1579 0.1145 0.0789 0.0866 0.1163 0.0992 0.1166 0.1043 0.1031 0.0987 0.0960 0.0895 0.0871 0.1628 0.1528 0.1594 0.1591 0.1259 0.1249 0.1324
va: 1.1251 1.1253 1.1406 2.1260 2.0771 2.1207 2.0744 2.0241 3.1205 3.8315 3.9641 3.7997 3.7900 3.6746 3.8070 3.8748 4.1011 3.8248 3.8823 3.9145 3.9205 3.9149 3.6810 3.9654 4.0321 4.2604 3.9925 3.9945 3.7384 3.8460 4.6128 1.0097 1.0395 1.0231 1.0039 0.9957 1.0145 0.9903 0.9961 0.9983 1.0035 1.0041 1.0015 1.0072 0.9934 1.0038 0.9976 0.9969 0.9908 0.9909 0.9951
dispcorr: -0.024543887 hartree
energy: -1581.036570452738
dipole: -62.36427 62.27611 -0.08816 7.89314 -6.68738 1.20575 -7.70628 7.68843 -0.01785
magnitude: 1.20910 au
magnitude: 3.07330 debye
