program: Orca
programVersion: 5.0.2
elementType: F F F O O O O O N C C C C C C C C C C C C C C C C C C C C C C H H H H H H H H H H H H H H H H H H H H
charge: 0
multiplicity: 1
keywords: wb97x-d3
keywords: def2-TZVPP
keywords: def2/J RIJCOSX
keywords: DEFGRID2
keywords: scfconv7
keywords: smallprint printgap noloewdin
keywords: NOSOSCF
formula: C22H20F3NO5
InChI: InChI=1/C22H20F3NO5/c1-5-17-13(3)20(30-21(27)28-4)16-11-19(12(2)10-18(16)26-17)29-14-6-8-15(9-7-14)31-22(23,24)25/h6-11H,5H2,1-4H3
51 atoms
F  7.246379 0.369921 1.002877
F  5.941539 -1.131292 1.831653
F  6.607095 -1.302478 -0.194214
O  -1.834796 2.126773 0.262307
O  0.503451 -2.295707 -0.808432
O  -0.68871 3.586074 -0.796912
O  5.200693 0.344486 0.334824
O  -2.300291 2.479672 -1.914867
N  -4.624726 -0.909529 0.593034
C  -2.363838 -0.19424 0.115695
C  -3.347301 -1.19367 0.258112
C  -4.080971 1.434633 0.672971
C  -4.984241 0.33247 0.789312
C  -2.791914 1.131356 0.337617
C  -1.044972 -0.549201 -0.235058
C  -1.704275 -2.897362 -0.298624
C  -2.981306 -2.539062 0.04031
C  -0.736684 -1.867626 -0.430733
C  -6.432389 0.570302 1.10823
C  -4.546507 2.835591 0.922701
C  -1.321164 -4.325814 -0.525876
C  -7.259878 0.808214 -0.153843
C  1.626263 -1.573237 -0.502923
C  2.537969 -1.349858 -1.522608
C  1.885458 -1.141688 0.791937
C  -1.661546 2.718828 -0.926741
C  3.740839 -0.718716 -1.243267
C  3.07992 -0.498939 1.068541
C  3.999373 -0.308249 0.051089
C  -0.3327 4.334999 -1.965686
C  6.22446 -0.426365 0.735494
H  -0.285508 0.213811 -0.346034
H  -3.741915 -3.30177 0.152976
H  -6.818337 -0.30578 1.630076
H  -6.546283 1.417577 1.785309
H  -3.755123 3.572144 0.809284
H  -5.349778 3.11063 0.238514
H  -4.938942 2.938744 1.935205
H  -2.175927 -4.979748 -0.363885
H  -0.963253 -4.491585 -1.543222
H  -0.525148 -4.642731 0.149744
H  -6.91521 1.68181 -0.70804
H  -7.211755 -0.051389 -0.822536
H  -8.306552 0.971647 0.103035
H  2.319387 -1.68091 -2.529279
H  1.172209 -1.310626 1.587933
H  4.457213 -0.541366 -2.034244
H  3.286862 -0.153251 2.072465
H  -1.170144 4.934684 -2.319088
H  0.015721 3.677925 -2.761198
H  0.476233 4.990246 -1.658814
elementType: F O N C H
totalener: -1581.01190273 hartree
nucrepener: 3056.60241881 hartree
electener: -4637.61432153 hartree
oneelecener: -8242.82780823 hartree
twoeener: 3605.21348669 hartree
cpcmener: -0.03459354 hartree
kineticenergy: 1574.75646661 hartree
xcener: -144.854176361223 hartree
chargesum: -0.0000000
charge: -0.166000 -0.174039 -0.174323 -0.321451 -0.338690 -0.290448 -0.314270 -0.467097 -0.350247 -0.027467 0.097254 -0.029329 0.200236 0.222757 -0.140162 -0.078516 -0.187267 0.252950 -0.144326 -0.257835 -0.239621 -0.271614 0.300236 -0.241463 -0.202774 0.586870 -0.126645 -0.137662 0.185363 -0.124143 0.591088 0.159609 0.114563 0.078839 0.086321 0.099039 0.117190 0.116701 0.098673 0.104594 0.103445 0.089384 0.087202 0.096122 0.152021 0.162549 0.158839 0.159332 0.126144 0.125551 0.132515
qa: -0.1660 -0.1740 -0.1743 -0.3215 -0.3387 -0.2904 -0.3143 -0.4671 -0.3502 -0.0275 0.0973 -0.0293 0.2002 0.2228 -0.1402 -0.0785 -0.1873 0.2530 -0.1443 -0.2578 -0.2396 -0.2716 0.3002 -0.2415 -0.2028 0.5869 -0.1266 -0.1377 0.1854 -0.1241 0.5911 0.1596 0.1146 0.0788 0.0863 0.0990 0.1172 0.1167 0.0987 0.1046 0.1034 0.0894 0.0872 0.0961 0.1520 0.1625 0.1588 0.1593 0.1261 0.1256 0.1325
va: 1.1398 1.1248 1.1255 2.1261 2.0787 2.1212 2.0742 2.0249 3.1203 3.8254 3.9655 3.7961 3.7909 3.6753 3.8132 3.8752 4.1001 3.8188 3.8821 3.9151 3.9212 3.9149 3.6674 4.0367 3.9613 4.2618 3.9925 3.9897 3.7441 3.8459 4.6133 1.0079 1.0396 1.0231 1.0041 1.0144 0.9902 0.9959 1.0035 0.9959 0.9983 1.0015 1.0072 1.0041 1.0048 0.9935 0.9966 0.9977 0.9907 0.9907 0.9951
dispcorr: -0.024488149 hartree
energy: -1581.036390873570
dipole: -62.71399 62.55272 -0.16127 8.08385 -6.85544 1.22841 -6.67745 6.68537 0.00791
magnitude: 1.23897 au
magnitude: 3.14922 debye
