program: Orca
programVersion: 5.0.2
elementType: F F F O O O O O N C C C C C C C C C C C C C C C C C C C C C C H H H H H H H H H H H H H H H H H H H H
charge: 0
multiplicity: 1
keywords: wb97x-d3
keywords: def2-TZVPP
keywords: def2/J RIJCOSX
keywords: DEFGRID2
keywords: scfconv7
keywords: smallprint printgap noloewdin
keywords: NOSOSCF
formula: C22H20F3NO5
InChI: InChI=1/C22H20F3NO5/c1-5-17-13(3)20(30-21(27)28-4)16-11-19(12(2)10-18(16)26-17)29-14-6-8-15(9-7-14)31-22(23,24)25/h6-11H,5H2,1-4H3
51 atoms
F  5.348426 1.183247 -0.214369
F  4.617444 1.148272 1.797373
F  6.694164 0.72809 1.402687
O  -1.46346 1.951959 0.088752
O  0.405554 -2.699384 -0.922558
O  -0.080999 3.184061 -0.982869
O  5.248662 -0.767495 0.857558
O  -1.765525 2.225116 -2.127705
N  -4.597804 -0.744363 0.249651
C  -2.244598 -0.298138 -0.089936
C  -3.347101 -1.173883 -0.030362
C  -3.7809 1.513471 0.427382
C  -4.812998 0.525383 0.47634
C  -2.524422 1.065814 0.136146
C  -0.960108 -0.801679 -0.379322
C  -1.892784 -3.047211 -0.572116
C  -3.134992 -2.545451 -0.285974
C  -0.801332 -2.141637 -0.605352
C  -6.219356 0.922574 0.821717
C  -4.089334 2.960695 0.654632
C  -1.676994 -4.502689 -0.844178
C  -6.46116 0.90814 2.330369
C  1.571059 -2.149675 -0.458214
C  2.603637 -1.975117 -1.365331
C  1.74841 -1.851079 0.886743
C  -1.15369 2.44593 -1.118641
C  3.82889 -1.494682 -0.927597
C  2.969372 -1.365433 1.323227
C  3.995608 -1.190843 0.41028
C  0.426375 3.803565 -2.171239
C  5.46154 0.553042 0.954584
H  -0.106448 -0.137217 -0.417133
H  -3.987617 -3.212128 -0.246133
H  -6.448346 1.911788 0.423278
H  -6.90314 0.221881 0.341919
H  -4.719336 3.353035 -0.145468
H  -4.630345 3.107356 1.589227
H  -3.194845 3.576883 0.699063
H  -2.615551 -5.047988 -0.764084
H  -1.278908 -4.671623 -1.845882
H  -0.971925 -4.945968 -0.139434
H  -7.489921 1.190378 2.553962
H  -6.290838 -0.085746 2.744363
H  -5.805896 1.60451 2.854839
H  2.457374 -2.22105 -2.408544
H  0.947685 -2.001605 1.598582
H  4.644391 -1.370608 -1.626946
H  3.119087 -1.151561 2.372695
H  0.70571 3.056886 -2.912283
H  1.309271 4.353322 -1.861714
H  -0.301026 4.493272 -2.594763
elementType: F O N C H
totalener: -1581.01192075 hartree
nucrepener: 3094.95826665 hartree
electener: -4675.97018740 hartree
oneelecener: -8319.56475960 hartree
twoeener: 3643.59457220 hartree
cpcmener: -0.03445646 hartree
kineticenergy: 1574.76221722 hartree
xcener: -144.855220380231 hartree
chargesum: -0.0000000
charge: -0.174442 -0.174480 -0.166607 -0.323182 -0.342105 -0.288934 -0.314222 -0.465945 -0.349671 -0.023151 0.102665 -0.031678 0.206019 0.217021 -0.129193 -0.073149 -0.189401 0.233747 -0.143252 -0.262883 -0.238285 -0.271176 0.293028 -0.239089 -0.194447 0.586844 -0.131016 -0.136308 0.189585 -0.122905 0.591364 0.158384 0.114812 0.086603 0.078087 0.115900 0.116875 0.102083 0.098810 0.104943 0.103252 0.096132 0.087758 0.088916 0.151928 0.161482 0.158172 0.157764 0.124398 0.132976 0.125971
qa: -0.1744 -0.1745 -0.1666 -0.3232 -0.3421 -0.2889 -0.3142 -0.4659 -0.3497 -0.0232 0.1027 -0.0317 0.2060 0.2170 -0.1292 -0.0731 -0.1894 0.2337 -0.1433 -0.2629 -0.2383 -0.2712 0.2930 -0.2391 -0.1944 0.5868 -0.1310 -0.1363 0.1896 -0.1229 0.5914 0.1584 0.1148 0.0866 0.0781 0.1159 0.1169 0.1021 0.0988 0.1049 0.1033 0.0961 0.0878 0.0889 0.1519 0.1615 0.1582 0.1578 0.1244 0.1330 0.1260
va: 1.1254 1.1247 1.1387 2.1230 2.0754 2.1234 2.0757 2.0261 3.1202 3.8147 3.9605 3.8033 3.7836 3.6902 3.8068 3.8762 4.1008 3.8281 3.8839 3.9125 3.9210 3.9129 3.6753 4.0336 3.9598 4.2610 3.9945 3.9967 3.7368 3.8452 4.6135 1.0098 1.0394 1.0025 1.0238 0.9921 0.9945 1.0139 1.0035 0.9957 0.9985 1.0040 1.0068 1.0019 1.0044 0.9940 0.9968 0.9991 0.9912 0.9948 0.9911
dispcorr: -0.024590504 hartree
energy: -1581.036511256545
dipole: -54.47527 54.61658 0.14131 -0.65646 1.39847 0.74202 -2.82694 2.90665 0.07972
magnitude: 0.75955 au
magnitude: 1.93062 debye
