program: Orca
programVersion: 5.0.2
elementType: F F F O O O O O N C C C C C C C C C C C C C C C C C C C C C C H H H H H H H H H H H H H H H H H H H H
charge: 0
multiplicity: 1
keywords: wb97x-d3
keywords: def2-TZVPP
keywords: def2/J RIJCOSX
keywords: DEFGRID2
keywords: scfconv7
keywords: smallprint printgap noloewdin
keywords: NOSOSCF
formula: C22H20F3NO5
InChI: InChI=1/C22H20F3NO5/c1-5-17-13(3)20(30-21(27)28-4)16-11-19(12(2)10-18(16)26-17)29-14-6-8-15(9-7-14)31-22(23,24)25/h6-11H,5H2,1-4H3
51 atoms
F  5.218234 1.231976 0.006269
F  4.096144 1.221699 1.829737
F  6.228078 0.922229 1.882189
O  -1.392381 1.929807 0.019367
O  0.413725 -2.667231 -1.18479
O  -0.156693 3.334841 -1.015396
O  5.013517 -0.686144 1.122819
O  -2.038267 2.622311 -2.025961
N  -4.535601 -0.748929 0.266164
C  -2.20558 -0.29682 -0.197101
C  -3.304042 -1.174449 -0.09326
C  -3.698366 1.500028 0.472518
C  -4.732386 0.514801 0.539846
C  -2.463706 1.059198 0.091235
C  -0.942452 -0.793947 -0.57154
C  -1.879073 -3.038789 -0.737453
C  -3.106414 -2.541325 -0.382314
C  -0.79388 -2.131451 -0.818417
C  -6.117675 0.906916 0.968067
C  -3.978602 2.940085 0.773179
C  -1.673391 -4.492485 -1.027545
C  -6.282138 0.84905 2.486732
C  1.547979 -2.17637 -0.591942
C  2.627019 -1.862486 -1.402846
C  1.630559 -2.036014 0.788493
C  -1.262718 2.640017 -1.10975
C  3.793398 -1.369702 -0.834162
C  2.78717 -1.530968 1.354792
C  3.849721 -1.187537 0.535358
C  0.183828 4.161743 -2.135389
C  5.125743 0.650404 1.203656
H  -0.096249 -0.123699 -0.653021
H  -3.955463 -3.20917 -0.304025
H  -6.361802 1.907492 0.608628
H  -6.828048 0.222027 0.504376
H  -3.069929 3.515212 0.938242
H  -4.523144 3.410566 -0.047696
H  -4.58998 3.047327 1.667724
H  -2.603832 -5.042527 -0.900332
H  -1.327617 -4.655581 -2.049512
H  -0.930023 -4.934536 -0.362641
H  -6.105988 -0.159808 2.860011
H  -5.589481 1.51873 2.998024
H  -7.293416 1.138775 2.772153
H  2.559539 -1.994563 -2.474881
H  0.797403 -2.309176 1.423492
H  4.641231 -1.130306 -1.462244
H  2.861576 -1.418163 2.428325
H  -0.578361 4.919421 -2.311427
H  0.328201 3.563961 -3.03416
H  1.118753 4.644704 -1.869239
elementType: F O N C H
totalener: -1581.01135250 hartree
nucrepener: 3103.93897679 hartree
electener: -4684.95032929 hartree
oneelecener: -8337.57762049 hartree
twoeener: 3652.62729120 hartree
cpcmener: -0.03419054 hartree
kineticenergy: 1574.74130955 hartree
xcener: -144.850832590395 hartree
chargesum: -0.0000000
charge: -0.175322 -0.173743 -0.165816 -0.322872 -0.349152 -0.289143 -0.314403 -0.466116 -0.349856 -0.017232 0.101557 -0.016563 0.216314 0.207025 -0.098063 -0.048272 -0.200119 0.172277 -0.145325 -0.271499 -0.237022 -0.270841 0.265680 -0.233362 -0.156433 0.588585 -0.131231 -0.157284 0.194487 -0.123163 0.591143 0.156749 0.115447 0.087802 0.078429 0.106092 0.118684 0.117529 0.098410 0.105842 0.103168 0.088187 0.089235 0.095854 0.151925 0.161521 0.158186 0.159020 0.125481 0.125216 0.132989
qa: -0.1753 -0.1737 -0.1658 -0.3229 -0.3492 -0.2891 -0.3144 -0.4661 -0.3499 -0.0172 0.1016 -0.0166 0.2163 0.2070 -0.0981 -0.0483 -0.2001 0.1723 -0.1453 -0.2715 -0.2370 -0.2708 0.2657 -0.2334 -0.1564 0.5886 -0.1312 -0.1573 0.1945 -0.1232 0.5911 0.1567 0.1154 0.0878 0.0784 0.1061 0.1187 0.1175 0.0984 0.1058 0.1032 0.0882 0.0892 0.0959 0.1519 0.1615 0.1582 0.1590 0.1255 0.1252 0.1330
va: 1.1243 1.1251 1.1397 2.1241 2.0638 2.1234 2.0739 2.0295 3.1197 3.7885 3.9618 3.7773 3.7646 3.7136 3.7737 3.8626 4.1109 3.8492 3.8863 3.9122 3.9207 3.9126 3.7033 4.0258 3.9123 4.2621 3.9933 4.0019 3.7290 3.8447 4.6113 1.0139 1.0392 1.0006 1.0237 1.0098 0.9921 0.9957 1.0038 0.9954 0.9983 1.0068 1.0019 1.0043 1.0042 0.9927 0.9977 0.9972 0.9910 0.9909 0.9948
dispcorr: -0.024742319 hartree
energy: -1581.036094819872
dipole: -52.20814 52.38732 0.17918 -0.92774 1.61658 0.68884 -3.44834 3.50416 0.05582
magnitude: 0.71395 au
magnitude: 1.81471 debye
