program: Orca
programVersion: 5.0.2
elementType: F F F O O O O O N C C C C C C C C C C C C C C C C C C C C C C H H H H H H H H H H H H H H H H H H H H
charge: 0
multiplicity: 1
keywords: wb97x-d3
keywords: def2-TZVPP
keywords: def2/J RIJCOSX
keywords: DEFGRID2
keywords: scfconv7
keywords: smallprint printgap noloewdin
keywords: NOSOSCF
formula: C22H20F3NO5
InChI: InChI=1/C22H20F3NO5/c1-5-17-13(3)20(30-21(27)28-4)16-11-19(12(2)10-18(16)26-17)29-14-6-8-15(9-7-14)31-22(23,24)25/h6-11H,5H2,1-4H3
51 atoms
F  6.659442 -1.282999 0.006338
F  7.145822 0.361895 1.310434
F  5.828285 -1.208748 1.976464
O  -1.850267 2.144064 0.140934
O  0.521221 -2.184553 -1.129883
O  -0.849505 3.81466 -0.735457
O  5.16674 0.303321 0.479435
O  -2.57791 2.902386 -1.853698
N  -4.637758 -0.907664 0.269589
C  -2.373949 -0.15803 -0.134563
C  -3.352311 -1.169627 -0.052736
C  -4.101159 1.426942 0.508469
C  -5.003949 0.31989 0.534369
C  -2.809264 1.150036 0.159671
C  -1.05135 -0.484079 -0.496556
C  -1.687823 -2.832795 -0.66576
C  -2.973112 -2.500241 -0.329519
C  -0.72883 -1.79018 -0.743132
C  -6.44425 0.527005 0.907025
C  -4.571308 2.813128 0.825211
C  -1.28984 -4.246573 -0.952034
C  -6.6700 0.403372 2.412808
C  1.640682 -1.528758 -0.695438
C  2.655879 -1.337165 -1.620675
C  1.799186 -1.126756 0.62542
C  -1.827541 2.962821 -0.918486
C  3.847462 -0.749689 -1.22492
C  2.98498 -0.52881 1.017908
C  3.995998 -0.349385 0.089906
C  -0.65906 4.805552 -1.753083
C  6.175644 -0.454553 0.933414
H  -0.30298 0.293573 -0.577133
H  -3.728887 -3.273132 -0.263083
H  -6.795369 1.499748 0.56034
H  -7.042746 -0.225439 0.392711
H  -5.214686 2.821047 1.703758
H  -3.750361 3.497264 1.02945
H  -5.150155 3.228878 -0.001667
H  -2.137839 -4.91576 -0.819398
H  -0.929371 -4.365429 -1.975111
H  -0.491169 -4.5836 -0.289518
H  -6.385021 -0.58607 2.770786
H  -6.092513 1.139243 2.973478
H  -7.722069 0.554452 2.654618
H  2.521102 -1.651821 -2.647109
H  1.013312 -1.277223 1.353524
H  4.637942 -0.588924 -1.945652
H  3.110187 -0.201315 2.041427
H  -0.401986 4.345161 -2.705789
H  0.169364 5.418952 -1.413139
H  -1.546252 5.426418 -1.867459
elementType: F O N C H
totalener: -1581.01182445 hartree
nucrepener: 3043.99431732 hartree
electener: -4625.00614177 hartree
oneelecener: -8217.55055611 hartree
twoeener: 3592.54441434 hartree
cpcmener: -0.03379851 hartree
kineticenergy: 1574.76079210 hartree
xcener: -144.855541545422 hartree
chargesum: -0.0000000
charge: -0.175118 -0.166449 -0.173998 -0.320551 -0.339898 -0.289769 -0.314038 -0.465573 -0.351680 -0.019880 0.095443 -0.014395 0.216944 0.213776 -0.155170 -0.076960 -0.189040 0.249725 -0.145886 -0.272061 -0.241163 -0.269725 0.319674 -0.258385 -0.210340 0.585444 -0.117139 -0.133342 0.177430 -0.122857 0.589813 0.158518 0.115064 0.086938 0.078786 0.118734 0.105214 0.119598 0.098884 0.105096 0.103612 0.086596 0.088273 0.095954 0.151497 0.161998 0.158553 0.158779 0.125483 0.133024 0.124567
qa: -0.1751 -0.1664 -0.1740 -0.3206 -0.3399 -0.2898 -0.3140 -0.4656 -0.3517 -0.0199 0.0954 -0.0144 0.2169 0.2138 -0.1552 -0.0770 -0.1890 0.2497 -0.1459 -0.2721 -0.2412 -0.2697 0.3197 -0.2584 -0.2103 0.5854 -0.1171 -0.1333 0.1774 -0.1229 0.5898 0.1585 0.1151 0.0869 0.0788 0.1187 0.1052 0.1196 0.0989 0.1051 0.1036 0.0866 0.0883 0.0960 0.1515 0.1620 0.1586 0.1588 0.1255 0.1330 0.1246
va: 1.1248 1.1388 1.1251 2.1261 2.0798 2.1218 2.0744 2.0310 3.1182 3.7987 3.9683 3.7683 3.7614 3.7140 3.8241 3.8765 4.0996 3.8090 3.8871 3.9103 3.9228 3.9134 3.6557 4.0436 3.9533 4.2667 3.9887 3.9944 3.7459 3.8450 4.6166 1.0109 1.0396 1.0007 1.0229 0.9955 1.0094 0.9926 1.0036 0.9956 0.9982 1.0076 1.0020 1.0044 1.0056 0.9937 0.9970 0.9976 0.9909 0.9947 0.9912
dispcorr: -0.024334208 hartree
energy: -1581.036158659267
dipole: -61.53305 61.30558 -0.22747 7.96868 -6.73402 1.23465 -2.13877 2.25155 0.11278
magnitude: 1.26049 au
magnitude: 3.20391 debye
