program: Orca
programVersion: 5.0.2
elementType: F F F O O O O O N C C C C C C C C C C C C C C C C C C C C C C H H H H H H H H H H H H H H H H H H H H
charge: 0
multiplicity: 1
keywords: wb97x-d3
keywords: def2-TZVPP
keywords: def2/J RIJCOSX
keywords: DEFGRID2
keywords: scfconv7
keywords: smallprint printgap noloewdin
keywords: NOSOSCF
formula: C22H20F3NO5
InChI: InChI=1/C22H20F3NO5/c1-5-17-13(3)20(30-21(27)28-4)16-11-19(12(2)10-18(16)26-17)29-14-6-8-15(9-7-14)31-22(23,24)25/h6-11H,5H2,1-4H3
51 atoms
F  5.806575 -1.239128 2.097125
F  6.656245 -1.462701 0.144831
F  7.176095 0.245543 1.351335
O  -1.842352 2.18505 0.066448
O  0.519647 -2.150736 -1.19953
O  -0.885884 3.868476 -0.833973
O  5.207762 0.19379 0.498345
O  -2.629851 2.934429 -1.908852
N  -4.615415 -0.874114 0.288738
C  -2.362565 -0.122223 -0.170864
C  -3.335958 -1.135878 -0.057157
C  -4.081485 1.464491 0.491352
C  -4.97977 0.355027 0.548403
C  -2.796559 1.187869 0.117096
C  -1.046442 -0.449544 -0.55513
C  -1.678708 -2.802082 -0.681299
C  -2.958645 -2.468649 -0.325117
C  -0.724733 -1.75821 -0.789629
C  -6.412292 0.56141 0.950581
C  -4.547993 2.852952 0.803584
C  -1.283026 -4.218257 -0.957837
C  -6.602642 0.456731 2.462744
C  1.651984 -1.54246 -0.734284
C  2.705482 -1.421912 -1.62922
C  1.788588 -1.115253 0.580897
C  -1.856874 3.003999 -0.99295
C  3.907175 -0.873504 -1.2108
C  2.986426 -0.556178 0.995459
C  4.031192 -0.439899 0.096227
C  -0.731934 4.859952 -1.857076
C  6.186412 -0.563986 1.011899
H  -0.301572 0.328457 -0.661727
H  -3.710895 -3.242481 -0.234757
H  -6.775653 1.527934 0.59911
H  -7.018888 -0.200277 0.460065
H  -5.123561 3.268794 -0.025527
H  -5.192974 2.865999 1.680599
H  -3.724748 3.53429 1.007743
H  -2.126911 -4.887261 -0.800429
H  -0.942754 -4.348604 -1.986292
H  -0.470785 -4.545545 -0.307421
H  -6.30541 -0.526802 2.826938
H  -6.015301 1.201962 3.0004
H  -7.649408 0.607073 2.726924
H  2.590083 -1.759188 -2.65078
H  0.97615 -1.21161 1.28838
H  4.725153 -0.765166 -1.91019
H  3.091796 -0.204855 2.013181
H  -0.505081 4.401006 -2.817937
H  0.105287 5.475878 -1.544584
H  -1.624515 5.477569 -1.941737
elementType: F O N C H
totalener: -1581.01168858 hartree
nucrepener: 3039.35757186 hartree
electener: -4620.36926044 hartree
oneelecener: -8208.25075797 hartree
twoeener: 3587.88149753 hartree
cpcmener: -0.03372111 hartree
kineticenergy: 1574.76237381 hartree
xcener: -144.856029051757 hartree
chargesum: -0.0000000
charge: -0.174644 -0.175306 -0.166993 -0.320365 -0.339455 -0.289769 -0.313792 -0.465421 -0.351527 -0.017413 0.099208 -0.013683 0.217862 0.214413 -0.158761 -0.076135 -0.189960 0.245142 -0.146425 -0.272936 -0.241801 -0.270113 0.331691 -0.266266 -0.216601 0.585620 -0.114822 -0.131776 0.174853 -0.122844 0.589559 0.159864 0.115168 0.087473 0.079006 0.119902 0.118415 0.106297 0.098741 0.105557 0.103839 0.086726 0.088563 0.096039 0.151296 0.161356 0.158343 0.158812 0.125083 0.132885 0.125093
qa: -0.1746 -0.1753 -0.1670 -0.3204 -0.3395 -0.2898 -0.3138 -0.4654 -0.3515 -0.0174 0.0992 -0.0137 0.2179 0.2144 -0.1588 -0.0761 -0.1900 0.2451 -0.1464 -0.2729 -0.2418 -0.2701 0.3317 -0.2663 -0.2166 0.5856 -0.1148 -0.1318 0.1749 -0.1228 0.5896 0.1599 0.1152 0.0875 0.0790 0.1199 0.1184 0.1063 0.0987 0.1056 0.1038 0.0867 0.0886 0.0960 0.1513 0.1614 0.1583 0.1588 0.1251 0.1329 0.1251
va: 1.1245 1.1243 1.1378 2.1261 2.0810 2.1220 2.0747 2.0316 3.1172 3.7883 3.9645 3.7673 3.7609 3.7162 3.8340 3.8784 4.0998 3.8082 3.8877 3.9089 3.9235 3.9131 3.6497 4.0435 3.9491 4.2669 3.9880 3.9985 3.7481 3.8449 4.6180 1.0102 1.0398 1.0003 1.0230 0.9928 0.9958 1.0088 1.0035 0.9955 0.9980 1.0075 1.0020 1.0043 1.0061 0.9943 0.9970 0.9978 0.9911 0.9948 0.9909
dispcorr: -0.024301136 hartree
energy: -1581.035989715980
dipole: -61.44747 61.16558 -0.28189 8.79663 -7.54146 1.25516 -2.55799 2.63634 0.07835
magnitude: 1.28881 au
magnitude: 3.27590 debye
