program: Orca
programVersion: 5.0.2
elementType: F F F O O O O O N C C C C C C C C C C C C C C C C C C C C C C H H H H H H H H H H H H H H H H H H H H
charge: 0
multiplicity: 1
keywords: wb97x-d3
keywords: def2-TZVPP
keywords: def2/J RIJCOSX
keywords: DEFGRID2
keywords: scfconv7
keywords: smallprint printgap noloewdin
keywords: NOSOSCF
formula: C22H20F3NO5
InChI: InChI=1/C22H20F3NO5/c1-5-17-13(3)20(30-21(27)28-4)16-11-19(12(2)10-18(16)26-17)29-14-6-8-15(9-7-14)31-22(23,24)25/h6-11H,5H2,1-4H3
51 atoms
F  6.46501 -1.21665 -0.385841
F  5.568795 -0.214148 -2.052483
F  6.951627 0.844839 -0.78766
O  -2.077916 1.779902 1.430264
O  0.42805 -2.586947 0.671936
O  -0.663993 3.377921 1.524339
O  5.003786 0.41379 0.010481
O  -1.51202 2.823766 -0.485814
N  -4.650828 -0.826525 -0.483991
C  -2.478835 -0.362051 0.470732
C  -3.400084 -1.221978 -0.160368
C  -4.203941 1.351125 0.440029
C  -5.041056 0.392656 -0.212446
C  -2.941741 0.936923 0.758462
C  -1.180452 -0.818608 0.767851
C  -1.724851 -2.984017 -0.213511
C  -2.993477 -2.53567 -0.475397
C  -0.820448 -2.087992 0.408958
C  -6.423201 0.76953 -0.661425
C  -4.66831 2.741825 0.744147
C  -1.291467 -4.371311 -0.569589
C  -6.402582 1.62205 -1.928741
C  1.536867 -1.811482 0.474868
C  1.623832 -0.877827 -0.550839
C  2.612079 -2.028466 1.324748
C  -1.416184 2.689118 0.703078
C  2.78935 -0.148172 -0.713109
C  3.783189 -1.308196 1.152737
C  3.855294 -0.369555 0.139927
C  0.111082 4.439347 0.953464
C  5.973538 -0.045498 -0.792765
H  -0.47232 -0.167266 1.263984
H  -3.707939 -3.192987 -0.955271
H  -6.978687 -0.148153 -0.853353
H  -6.955301 1.300889 0.130058
H  -4.170988 3.153392 1.620931
H  -4.469313 3.416277 -0.09078
H  -5.738309 2.776188 0.936814
H  -2.104043 -4.914515 -1.048348
H  -0.444371 -4.364495 -1.257206
H  -0.985507 -4.938266 0.310889
H  -5.905958 1.096721 -2.745056
H  -7.418894 1.850356 -2.249926
H  -5.885032 2.569576 -1.778609
H  0.796349 -0.706402 -1.225693
H  2.536698 -2.758769 2.119698
H  2.853804 0.594411 -1.497266
H  4.617155 -1.465398 1.823587
H  0.637679 4.897127 1.784826
H  -0.530069 5.180769 0.478969
H  0.833017 4.056575 0.233828
elementType: F O N C H
totalener: -1581.01117980 hartree
nucrepener: 3076.83543261 hartree
electener: -4657.84661242 hartree
oneelecener: -8283.13162627 hartree
twoeener: 3625.28501385 hartree
cpcmener: -0.03299647 hartree
kineticenergy: 1574.77752964 hartree
xcener: -144.858556300215 hartree
chargesum: -0.0000000
charge: -0.174667 -0.174719 -0.166453 -0.322028 -0.342754 -0.289242 -0.314028 -0.467141 -0.343086 0.015283 0.107277 -0.023343 0.204856 0.211025 -0.162426 -0.063429 -0.194029 0.217166 -0.140345 -0.292164 -0.242920 -0.274658 0.320713 -0.195043 -0.265447 0.592864 -0.142395 -0.114635 0.175134 -0.122631 0.589396 0.156697 0.115848 0.075604 0.090847 0.118137 0.118191 0.120873 0.098624 0.104352 0.106532 0.090105 0.094885 0.094542 0.158638 0.150538 0.158699 0.158318 0.132737 0.125521 0.124183
qa: -0.1747 -0.1747 -0.1665 -0.3220 -0.3428 -0.2892 -0.3140 -0.4671 -0.3431 0.0153 0.1073 -0.0233 0.2049 0.2110 -0.1624 -0.0634 -0.1940 0.2172 -0.1403 -0.2922 -0.2429 -0.2747 0.3207 -0.1950 -0.2654 0.5929 -0.1424 -0.1146 0.1751 -0.1226 0.5894 0.1567 0.1158 0.0756 0.0908 0.1181 0.1182 0.1209 0.0986 0.1044 0.1065 0.0901 0.0949 0.0945 0.1586 0.1505 0.1587 0.1583 0.1327 0.1255 0.1242
va: 1.1249 1.1245 1.1389 2.1238 2.0762 2.1232 2.0740 2.0295 3.1253 3.7277 3.9496 3.7604 3.7953 3.7155 3.8232 3.8764 4.1017 3.8293 3.8570 3.8929 3.9226 3.9146 3.6615 3.9229 4.0404 4.2550 3.9974 3.9905 3.7445 3.8457 4.6176 1.0143 1.0397 1.0294 1.0036 1.0050 0.9922 0.9985 1.0037 0.9975 0.9953 1.0038 1.0047 0.9991 0.9964 1.0063 0.9985 0.9969 0.9948 0.9911 0.9908
dispcorr: -0.025001711 hartree
energy: -1581.036181514199
dipole: -58.32382 57.88711 -0.43670 8.12545 -7.04554 1.07992 0.06981 0.73042 0.80024
magnitude: 1.41326 au
magnitude: 3.59222 debye
