program: Orca
programVersion: 5.0.2
elementType: F F F O O O O O N C C C C C C C C C C C C C C C C C C C C C C H H H H H H H H H H H H H H H H H H H H
charge: 0
multiplicity: 1
keywords: wb97x-d3
keywords: def2-TZVPP
keywords: def2/J RIJCOSX
keywords: DEFGRID2
keywords: scfconv7
keywords: smallprint printgap noloewdin
keywords: NOSOSCF
formula: C22H20F3NO5
InChI: InChI=1/C22H20F3NO5/c1-5-17-13(3)20(30-21(27)28-4)16-11-19(12(2)10-18(16)26-17)29-14-6-8-15(9-7-14)31-22(23,24)25/h6-11H,5H2,1-4H3
51 atoms
F  6.646022 -0.879739 -0.304366
F  7.062706 0.642934 1.158517
F  5.984271 -1.136386 1.713752
O  -1.737553 2.150342 0.27641
O  0.474188 -2.286617 -0.974109
O  -0.5193 3.59267 -0.726613
O  5.035807 0.447323 0.469407
O  -2.189958 2.620603 -1.880663
N  -4.635153 -0.800186 0.408744
C  -2.343358 -0.141847 0.001498
C  -3.364271 -1.109892 0.06531
C  -4.003789 1.509042 0.65001
C  -4.949002 0.433482 0.693794
C  -2.726701 1.183706 0.299265
C  -1.032188 -0.523501 -0.345441
C  -1.77534 -2.834064 -0.58157
C  -3.04556 -2.44891 -0.242922
C  -0.766037 -1.838398 -0.616111
C  -6.36774 0.736241 1.084525
C  -4.432189 2.906275 0.968794
C  -1.445526 -4.256404 -0.908667
C  -7.312309 -0.450584 1.071488
C  1.593892 -1.595725 -0.588937
C  2.513321 -1.257288 -1.567691
C  1.829461 -1.290358 0.745696
C  -1.537988 2.785208 -0.886358
C  3.68473 -0.603787 -1.214599
C  2.993547 -0.629695 1.098153
C  3.904882 -0.289551 0.113448
C  -0.135519 4.376459 -1.863165
C  6.157201 -0.231313 0.752197
H  -0.243373 0.216148 -0.38866
H  -3.837039 -3.186888 -0.199842
H  -6.361921 1.18933 2.081273
H  -6.751671 1.520318 0.424217
H  -5.161828 3.264594 0.240255
H  -4.912513 2.952589 1.9469
H  -3.604243 3.610703 0.980083
H  -0.675704 -4.656327 -0.24719
H  -2.328781 -4.884549 -0.810348
H  -1.076259 -4.359861 -1.930298
H  -8.309335 -0.128101 1.372098
H  -7.395154 -0.896036 0.080819
H  -6.996034 -1.231425 1.762106
H  2.319852 -1.501923 -2.603714
H  1.114459 -1.561631 1.510874
H  4.397239 -0.32327 -1.977997
H  3.178361 -0.372557 2.1326
H  -0.945834 5.031375 -2.179782
H  0.174347 3.741002 -2.691164
H  0.706503 4.976687 -1.533685
elementType: F O N C H
totalener: -1581.01203175 hartree
nucrepener: 3059.59093880 hartree
electener: -4640.60297055 hartree
oneelecener: -8248.93239811 hartree
twoeener: 3608.32942756 hartree
cpcmener: -0.03427445 hartree
kineticenergy: 1574.77599867 hartree
xcener: -144.859712043588 hartree
chargesum: 0.0000000
charge: -0.174569 -0.166559 -0.173511 -0.322399 -0.341661 -0.290181 -0.313744 -0.466929 -0.361340 -0.021898 0.074659 -0.018663 0.178694 0.224782 -0.132348 -0.067921 -0.192004 0.239009 -0.095625 -0.260636 -0.238387 -0.270039 0.283933 -0.232242 -0.191996 0.588162 -0.125850 -0.138544 0.186944 -0.124068 0.589944 0.157320 0.117492 0.091544 0.088883 0.115753 0.113933 0.100567 0.102799 0.099030 0.104507 0.094269 0.078041 0.075856 0.151715 0.161968 0.158432 0.158734 0.125845 0.125244 0.133057
qa: -0.1746 -0.1666 -0.1735 -0.3224 -0.3417 -0.2902 -0.3137 -0.4669 -0.3613 -0.0219 0.0747 -0.0187 0.1787 0.2248 -0.1323 -0.0679 -0.1920 0.2390 -0.0956 -0.2606 -0.2384 -0.2700 0.2839 -0.2322 -0.1920 0.5882 -0.1258 -0.1385 0.1869 -0.1241 0.5899 0.1573 0.1175 0.0915 0.0889 0.1158 0.1139 0.1006 0.1028 0.0990 0.1045 0.0943 0.0780 0.0759 0.1517 0.1620 0.1584 0.1587 0.1258 0.1252 0.1331
va: 1.1253 1.1389 1.1258 2.1242 2.0742 2.1215 2.0747 2.0253 3.0928 3.8169 4.0156 3.8534 3.8057 3.6743 3.8013 3.8680 4.0711 3.8235 3.8310 3.9128 3.9205 3.9552 3.6840 4.0392 3.9600 4.2599 3.9946 3.9934 3.7383 3.8455 4.6175 1.0114 1.0354 1.0009 1.0001 0.9933 0.9972 1.0140 0.9986 1.0036 0.9956 1.0050 1.0082 1.0090 1.0041 0.9931 0.9979 0.9973 0.9910 0.9909 0.9948
dispcorr: -0.024259452 hartree
energy: -1581.036291205408
dipole: -62.37816 62.24281 -0.13534 4.42148 -3.27140 1.15008 -4.02327 4.14334 0.12007
magnitude: 1.16423 au
magnitude: 2.95923 debye
