program: Orca
programVersion: 5.0.2
elementType: F F F O O O O O N C C C C C C C C C C C C C C C C C C C C C C H H H H H H H H H H H H H H H H H H H H
charge: 0
multiplicity: 1
keywords: wb97x-d3
keywords: def2-TZVPP
keywords: def2/J RIJCOSX
keywords: DEFGRID2
keywords: scfconv7
keywords: smallprint printgap noloewdin
keywords: NOSOSCF
formula: C22H20F3NO5
InChI: InChI=1/C22H20F3NO5/c1-5-17-13(3)20(30-21(27)28-4)16-11-19(12(2)10-18(16)26-17)29-14-6-8-15(9-7-14)31-22(23,24)25/h6-11H,5H2,1-4H3
51 atoms
F  7.133837 0.064237 1.259569
F  6.106546 0.309357 -0.616544
F  5.218285 1.04523 1.186968
O  -1.5318 2.096906 0.193583
O  0.419662 -2.438729 -1.083353
O  -0.446943 3.70541 -0.699606
O  5.399367 -1.157826 0.905448
O  -2.315856 2.983521 -1.726027
N  -4.572062 -0.697271 0.421339
C  -2.25989 -0.153966 -0.0438
C  -3.321613 -1.073897 0.070755
C  -3.822363 1.578151 0.638845
C  -4.822162 0.554709 0.689726
C  -2.572208 1.190681 0.251585
C  -0.980858 -0.602418 -0.430647
C  -1.827158 -2.887206 -0.550666
C  -3.071385 -2.435006 -0.196666
C  -0.781748 -1.936319 -0.662151
C  -6.226638 0.933202 1.067011
C  -4.166349 2.993214 0.982483
C  -1.569346 -4.33618 -0.82167
C  -7.247518 -0.184387 0.968283
C  1.612211 -2.035544 -0.555105
C  2.7217 -2.182669 -1.378391
C  1.761172 -1.579673 0.749267
C  -1.504318 2.945858 -0.842218
C  3.985135 -1.875108 -0.902514
C  3.025266 -1.254613 1.218769
C  4.123947 -1.406359 0.392258
C  -0.249313 4.725794 -1.686762
C  5.94342 0.047915 0.681103
H  -0.165564 0.101094 -0.540596
H  -3.893775 -3.133976 -0.105765
H  -6.21698 1.332306 2.086633
H  -6.540674 1.77351 0.440404
H  -4.735131 3.467063 0.180003
H  -4.783687 3.037523 1.878967
H  -3.287735 3.605655 1.173172
H  -0.803353 -4.741157 -0.158741
H  -2.477762 -4.917546 -0.674848
H  -1.229791 -4.503282 -1.845009
H  -8.231305 0.193832 1.244779
H  -7.319342 -0.580627 -0.044101
H  -7.013201 -1.01348 1.634221
H  2.59992 -2.551853 -2.388381
H  0.911395 -1.47888 1.410813
H  4.84826 -2.018012 -1.538549
H  3.146278 -0.91092 2.237629
H  -0.128476 4.295409 -2.679498
H  0.664501 5.236732 -1.400829
H  -1.076083 5.434421 -1.68675
elementType: F O N C H
totalener: -1581.01106876 hartree
nucrepener: 3047.38903391 hartree
electener: -4628.40010268 hartree
oneelecener: -8224.48238765 hartree
twoeener: 3596.08228498 hartree
cpcmener: -0.03312389 hartree
kineticenergy: 1574.74110251 hartree
xcener: -144.854254252776 hartree
chargesum: -0.0000000
charge: -0.167239 -0.175266 -0.174544 -0.319806 -0.335013 -0.289316 -0.314274 -0.464832 -0.361721 -0.010610 0.084727 -0.013422 0.192834 0.229441 -0.173198 -0.074422 -0.190548 0.247828 -0.099603 -0.271469 -0.241761 -0.270851 0.351638 -0.280322 -0.227589 0.583738 -0.106745 -0.137080 0.170752 -0.122502 0.589801 0.160785 0.118042 0.092362 0.089324 0.119984 0.115696 0.106185 0.104271 0.098396 0.106001 0.094432 0.079319 0.076253 0.150062 0.161516 0.157289 0.158433 0.124024 0.133145 0.125855
qa: -0.1672 -0.1753 -0.1745 -0.3198 -0.3350 -0.2893 -0.3143 -0.4648 -0.3617 -0.0106 0.0847 -0.0134 0.1928 0.2294 -0.1732 -0.0744 -0.1905 0.2478 -0.0996 -0.2715 -0.2418 -0.2709 0.3516 -0.2803 -0.2276 0.5837 -0.1067 -0.1371 0.1708 -0.1225 0.5898 0.1608 0.1180 0.0924 0.0893 0.1200 0.1157 0.1062 0.1043 0.0984 0.1060 0.0944 0.0793 0.0763 0.1501 0.1615 0.1573 0.1584 0.1240 0.1331 0.1259
va: 1.1376 1.1241 1.1248 2.1260 2.0877 2.1227 2.0748 2.0330 3.0885 3.7693 4.0049 3.8175 3.7863 3.7027 3.8602 3.8836 4.0643 3.8026 3.8393 3.9074 3.9247 3.9539 3.6425 4.0381 3.9473 4.2705 3.9741 4.0143 3.7519 3.8441 4.6158 1.0108 1.0360 1.0012 0.9985 0.9942 0.9989 1.0087 0.9974 1.0034 0.9955 1.0052 1.0078 1.0093 1.0074 0.9951 0.9980 0.9974 0.9916 0.9947 0.9907
dispcorr: -0.023983310 hartree
energy: -1581.035052072799
dipole: -60.36801 60.12947 -0.23854 1.40534 -0.46223 0.94311 -2.34657 2.56285 0.21627
magnitude: 0.99656 au
magnitude: 2.53306 debye
