program: Orca
programVersion: 5.0.2
elementType: F F F O O O O O N C C C C C C C C C C C C C C C C C C C C C C H H H H H H H H H H H H H H H H H H H H
charge: 0
multiplicity: 1
keywords: wb97x-d3
keywords: def2-TZVPP
keywords: def2/J RIJCOSX
keywords: DEFGRID2
keywords: scfconv7
keywords: smallprint printgap noloewdin
keywords: NOSOSCF
formula: C22H20F3NO5
InChI: InChI=1/C22H20F3NO5/c1-5-17-13(3)20(30-21(27)28-4)16-11-19(12(2)10-18(16)26-17)29-14-6-8-15(9-7-14)31-22(23,24)25/h6-11H,5H2,1-4H3
51 atoms
F  5.902304 -1.419088 1.975735
F  6.706979 -1.631436 0.002872
F  7.324522 0.020688 1.238996
O  -1.83742 2.298128 0.158326
O  0.512871 -2.020395 -1.209716
O  -0.930488 3.98592 -0.784143
O  5.338835 0.078761 0.423377
O  -2.691946 3.019565 -1.799713
N  -4.568763 -0.79006 0.485439
C  -2.339063 -0.018334 -0.053598
C  -3.297643 -1.040507 0.096996
C  -4.052331 1.553481 0.655169
C  -4.938763 0.432861 0.748918
C  -2.778016 1.289954 0.243858
C  -1.035402 -0.335152 -0.485756
C  -1.649252 -2.694285 -0.578382
C  -2.91838 -2.370666 -0.175251
C  -0.712503 -1.641948 -0.732407
C  -6.360999 0.670569 1.171784
C  -4.534794 2.931563 0.982412
C  -1.251668 -4.109003 -0.86026
C  -7.259109 -0.551727 1.145831
C  1.674417 -1.463932 -0.756135
C  2.716087 -1.384445 -1.670958
C  1.85598 -1.05333 0.558901
C  -1.893738 3.107068 -0.907349
C  3.950632 -0.89973 -1.272081
C  3.089173 -0.559246 0.954617
C  4.122496 -0.487966 0.037349
C  -0.817752 4.968165 -1.82119
C  6.292067 -0.734931 0.899724
H  -0.300911 0.44777 -0.624987
H  -3.65954 -3.150534 -0.050934
H  -6.355065 1.099925 2.17914
H  -6.786407 1.453732 0.536737
H  -5.205015 3.306423 0.206081
H  -5.095621 2.937836 1.916741
H  -3.724232 3.648346 1.093931
H  -0.951483 -4.2451 -1.900402
H  -0.411148 -4.423691 -0.239927
H  -2.082488 -4.784155 -0.663893
H  -6.907906 -1.332364 1.819123
H  -8.264805 -0.272955 1.460094
H  -7.333644 -0.981128 0.147265
H  2.564557 -1.706741 -2.692869
H  1.053624 -1.115099 1.282038
H  4.759234 -0.825652 -1.987188
H  3.231057 -0.22379 1.973459
H  0.019824 5.597916 -1.538685
H  -1.720337 5.574111 -1.886846
H  -0.612244 4.501971 -2.783763
elementType: F O N C H
totalener: -1581.01162180 hartree
nucrepener: 3029.65677930 hartree
electener: -4610.66840111 hartree
oneelecener: -8189.00211756 hartree
twoeener: 3578.33371645 hartree
cpcmener: -0.03361152 hartree
kineticenergy: 1574.74636512 hartree
xcener: -144.854875788547 hartree
chargesum: -0.0000000
charge: -0.174513 -0.175202 -0.167433 -0.320223 -0.338334 -0.290031 -0.314127 -0.465723 -0.363122 -0.017000 0.084909 -0.014480 0.191044 0.230575 -0.153179 -0.070643 -0.192302 0.234681 -0.098272 -0.266977 -0.242554 -0.270960 0.338084 -0.272209 -0.217644 0.584786 -0.112699 -0.132532 0.172852 -0.122868 0.589108 0.160050 0.117758 0.092591 0.089039 0.119916 0.115242 0.103934 0.105688 0.103862 0.098583 0.075349 0.094360 0.079415 0.150728 0.160954 0.158164 0.158521 0.132618 0.125139 0.125076
qa: -0.1745 -0.1752 -0.1674 -0.3202 -0.3383 -0.2900 -0.3141 -0.4657 -0.3631 -0.0170 0.0849 -0.0145 0.1910 0.2306 -0.1532 -0.0706 -0.1923 0.2347 -0.0983 -0.2670 -0.2426 -0.2710 0.3381 -0.2722 -0.2176 0.5848 -0.1127 -0.1325 0.1729 -0.1229 0.5891 0.1600 0.1178 0.0926 0.0890 0.1199 0.1152 0.1039 0.1057 0.1039 0.0986 0.0753 0.0944 0.0794 0.1507 0.1610 0.1582 0.1585 0.1326 0.1251 0.1251
va: 1.1246 1.1243 1.1370 2.1259 2.0801 2.1219 2.0739 2.0309 3.0882 3.7835 4.0042 3.8246 3.7907 3.6952 3.8512 3.8711 4.0675 3.8144 3.8374 3.9097 3.9244 3.9551 3.6465 4.0434 3.9456 4.2680 3.9874 4.0018 3.7480 3.8452 4.6180 1.0101 1.0360 1.0010 0.9989 0.9937 0.9986 1.0102 0.9955 0.9977 1.0035 1.0094 1.0050 1.0076 1.0067 0.9951 0.9970 0.9979 0.9949 0.9908 0.9910
dispcorr: -0.024005379 hartree
energy: -1581.035627183130
dipole: -63.57195 63.15806 -0.41389 8.00579 -6.67807 1.32771 -4.41190 4.48943 0.07753
magnitude: 1.39289 au
magnitude: 3.54044 debye
