program: Orca
programVersion: 5.0.2
elementType: F F F O O O O O N C C C C C C C C C C C C C C C C C C C C C C H H H H H H H H H H H H H H H H H H H H
charge: 0
multiplicity: 1
keywords: wb97x-d3
keywords: def2-TZVPP
keywords: def2/J RIJCOSX
keywords: DEFGRID2
keywords: scfconv7
keywords: smallprint printgap noloewdin
keywords: NOSOSCF
formula: C22H20F3NO5
InChI: InChI=1/C22H20F3NO5/c1-5-17-13(3)20(30-21(27)28-4)16-11-19(12(2)10-18(16)26-17)29-14-6-8-15(9-7-14)31-22(23,24)25/h6-11H,5H2,1-4H3
51 atoms
F  5.560846 -0.468682 1.823918
F  6.430176 -1.085099 -0.03178
F  6.866211 0.870533 0.756732
O  -2.032169 2.032866 -0.963619
O  0.368232 -2.472506 -0.963017
O  -0.304258 3.263983 -0.687588
O  4.900952 0.534136 -0.052828
O  -1.010006 2.015116 1.046807
N  -4.743459 -0.848997 0.250661
C  -2.520583 -0.264133 -0.498301
C  -3.478839 -1.203498 -0.068181
C  -4.210166 1.455836 -0.203266
C  -5.101933 0.406819 0.183682
C  -2.940366 1.081702 -0.536482
C  -1.223513 -0.692127 -0.836902
C  -1.821875 -2.977316 -0.238696
C  -3.097283 -2.557802 0.038148
C  -0.886465 -2.006971 -0.675898
C  -6.511221 0.727988 0.59021
C  -4.669044 2.880418 -0.243767
C  -1.415261 -4.409687 -0.090962
C  -6.616329 1.026155 2.085328
C  1.463936 -1.690192 -0.710722
C  2.501841 -1.743843 -1.628943
C  1.570168 -0.907007 0.43362
C  -1.093176 2.409421 -0.084172
C  3.662546 -1.020442 -1.400775
C  2.72428 -0.174987 0.655073
C  3.758859 -0.242525 -0.262004
C  0.818972 3.739933 0.06533
C  5.915221 -0.037646 0.613238
H  -0.492253 0.008558 -1.218663
H  -3.838251 -3.274141 0.370999
H  -6.894779 1.573793 0.018271
H  -7.142752 -0.128153 0.351184
H  -3.856243 3.573721 -0.444551
H  -5.421591 3.023874 -1.020977
H  -5.124373 3.176206 0.701202
H  -1.078099 -4.835555 -1.037113
H  -0.596947 -4.522403 0.621846
H  -2.251526 -5.008943 0.263978
H  -6.299078 0.167894 2.677886
H  -6.000309 1.877804 2.376069
H  -7.646681 1.255817 2.356995
H  2.408263 -2.351799 -2.519254
H  0.766053 -0.858511 1.155837
H  4.46904 -1.051429 -2.1213
H  2.807061 0.44678 1.536588
H  1.35065 4.414506 -0.597196
H  1.476127 2.91705 0.346313
H  0.498773 4.280477 0.955023
elementType: F O N C H
totalener: -1581.01132925 hartree
nucrepener: 3110.82952150 hartree
electener: -4691.84085075 hartree
oneelecener: -8351.10774949 hartree
twoeener: 3659.26689874 hartree
cpcmener: -0.03314244 hartree
kineticenergy: 1574.76191415 hartree
xcener: -144.856154349359 hartree
chargesum: -0.0000000
charge: -0.174177 -0.174891 -0.166476 -0.318729 -0.343879 -0.289510 -0.315065 -0.463081 -0.350992 0.019774 0.106422 -0.036478 0.202537 0.223101 -0.182947 -0.076888 -0.191184 0.250634 -0.145032 -0.257743 -0.240197 -0.269828 0.321981 -0.259200 -0.194871 0.583432 -0.117006 -0.162739 0.194732 -0.118236 0.588788 0.162161 0.114805 0.086791 0.078696 0.099942 0.114801 0.114718 0.105517 0.103968 0.099031 0.087000 0.088642 0.095972 0.151065 0.157879 0.158131 0.159665 0.133219 0.118151 0.127595
qa: -0.1742 -0.1749 -0.1665 -0.3187 -0.3439 -0.2895 -0.3151 -0.4631 -0.3510 0.0198 0.1064 -0.0365 0.2025 0.2231 -0.1829 -0.0769 -0.1912 0.2506 -0.1450 -0.2577 -0.2402 -0.2698 0.3220 -0.2592 -0.1949 0.5834 -0.1170 -0.1627 0.1947 -0.1182 0.5888 0.1622 0.1148 0.0868 0.0787 0.0999 0.1148 0.1147 0.1055 0.1040 0.0990 0.0870 0.0886 0.0960 0.1511 0.1579 0.1581 0.1597 0.1332 0.1182 0.1276
va: 1.1249 1.1244 1.1391 2.1271 2.0821 2.1227 2.0701 2.0265 3.1195 3.7304 3.9604 3.8096 3.7842 3.7034 3.8047 3.8876 4.1007 3.8092 3.8843 3.9114 3.9211 3.9153 3.6578 4.0473 3.8996 4.2618 3.9914 3.9606 3.7303 3.8503 4.6197 1.0064 1.0395 1.0029 1.0227 1.0146 0.9938 0.9910 0.9954 0.9978 1.0037 1.0077 1.0014 1.0042 1.0058 0.9997 0.9971 0.9978 0.9953 0.9848 0.9919
dispcorr: -0.026011690 hartree
energy: -1581.037340943842
dipole: -57.72548 57.40528 -0.32020 5.42263 -4.29835 1.12428 2.20382 -2.73244 -0.52862
magnitude: 1.28296 au
magnitude: 3.26102 debye
