program: Orca
programVersion: 5.0.2
elementType: F F F O O O O O N C C C C C C C C C C C C C C C C C C C C C C H H H H H H H H H H H H H H H H H H H H
charge: 0
multiplicity: 1
keywords: wb97x-d3
keywords: def2-TZVPP
keywords: def2/J RIJCOSX
keywords: DEFGRID2
keywords: scfconv7
keywords: smallprint printgap noloewdin
keywords: NOSOSCF
formula: C22H20F3NO5
InChI: InChI=1/C22H20F3NO5/c1-5-17-13(3)20(30-21(27)28-4)16-11-19(12(2)10-18(16)26-17)29-14-6-8-15(9-7-14)31-22(23,24)25/h6-11H,5H2,1-4H3
51 atoms
F  5.339105 0.861889 1.071496
F  6.524783 1.17472 -0.699742
F  4.44228 1.718047 -0.675939
O  -1.739299 1.819624 1.355305
O  0.334437 -2.817605 0.742191
O  -0.67718 1.914292 -0.573904
O  5.076453 -0.418046 -0.73087
O  0.101325 3.021277 1.221155
N  -4.608147 -0.655406 -0.31532
C  -2.365114 -0.351629 0.53984
C  -3.384325 -1.149038 -0.020208
C  -3.903876 1.52486 0.429356
C  -4.863677 0.60954 -0.106657
C  -2.680083 1.008965 0.746376
C  -1.112862 -0.925189 0.828616
C  -1.882319 -3.062842 -0.056376
C  -3.114322 -2.507446 -0.289307
C  -0.883067 -2.233085 0.505247
C  -6.229432 1.095361 -0.498308
C  -4.251385 2.966015 0.6387
C  -1.585298 -4.493049 -0.379998
C  -6.258277 1.626255 -1.930725
C  1.477479 -2.172031 0.35564
C  1.533284 -1.356992 -0.769696
C  2.616499 -2.409746 1.111886
C  -0.694082 2.307973 0.674854
C  2.73361 -0.763937 -1.124499
C  3.817732 -1.818925 0.753554
C  3.860233 -0.993717 -0.355267
C  0.445261 2.317204 -1.370571
C  5.330606 0.81247 -0.260472
H  -0.325659 -0.345106 1.293504
H  -3.905301 -3.111296 -0.71675
H  -6.928357 0.263087 -0.411095
H  -6.573437 1.870713 0.187692
H  -4.612475 3.422139 -0.282955
H  -5.044804 3.071613 1.380356
H  -3.404557 3.55498 0.981132
H  -1.300745 -5.058762 0.508389
H  -2.457726 -4.975743 -0.816409
H  -0.76387 -4.579973 -1.092772
H  -5.984779 0.847023 -2.642244
H  -7.258661 1.975244 -2.186754
H  -5.571353 2.461282 -2.071292
H  0.657424 -1.176466 -1.378489
H  2.56663 -3.054065 1.979797
H  2.782381 -0.139712 -2.006804
H  4.708984 -2.006735 1.337437
H  0.318345 1.819749 -2.326834
H  1.383079 2.002221 -0.915765
H  0.447062 3.395912 -1.518293
elementType: F O N C H
totalener: -1581.00903587 hartree
nucrepener: 3163.35697809 hartree
electener: -4744.36601397 hartree
oneelecener: -8455.18507441 hartree
twoeener: 3710.81906045 hartree
cpcmener: -0.03653485 hartree
kineticenergy: 1574.75749592 hartree
xcener: -144.855768981154 hartree
chargesum: -0.0000000
charge: -0.174262 -0.166498 -0.173607 -0.310806 -0.344860 -0.263433 -0.314691 -0.463718 -0.349444 0.016389 0.124750 -0.042797 0.198940 0.241961 -0.164166 -0.057622 -0.201628 0.201128 -0.142793 -0.258039 -0.242154 -0.272086 0.311387 -0.172549 -0.256548 0.546419 -0.182266 -0.126610 0.197402 -0.131496 0.590847 0.162942 0.116557 0.078224 0.086479 0.114634 0.113876 0.100942 0.107032 0.098517 0.104399 0.087576 0.095875 0.089943 0.158664 0.150670 0.164904 0.157690 0.134926 0.114844 0.144161
qa: -0.1743 -0.1665 -0.1736 -0.3108 -0.3449 -0.2634 -0.3147 -0.4637 -0.3494 0.0164 0.1247 -0.0428 0.1989 0.2420 -0.1642 -0.0576 -0.2016 0.2011 -0.1428 -0.2580 -0.2422 -0.2721 0.3114 -0.1725 -0.2565 0.5464 -0.1823 -0.1266 0.1974 -0.1315 0.5908 0.1629 0.1166 0.0782 0.0865 0.1146 0.1139 0.1009 0.1070 0.0985 0.1044 0.0876 0.0959 0.0899 0.1587 0.1507 0.1649 0.1577 0.1349 0.1148 0.1442
va: 1.1253 1.1391 1.1228 2.1305 2.0760 2.0996 2.0751 2.0458 3.1172 3.7027 3.9321 3.8017 3.7936 3.7190 3.8357 3.8798 4.1047 3.8368 3.8802 3.9114 3.9211 3.9153 3.6712 3.8686 4.0357 4.3188 3.9743 3.9971 3.7363 3.8207 4.6071 1.0068 1.0398 1.0238 1.0033 0.9915 0.9951 1.0151 0.9952 1.0038 0.9972 1.0068 1.0041 1.0015 0.9960 1.0058 0.9945 0.9966 0.9916 0.9945 0.9940
dispcorr: -0.027332906 hartree
energy: -1581.036368780269
dipole: -53.66457 52.72670 -0.93787 -3.17051 2.81720 -0.35331 -9.88544 8.39894 -1.48649
magnitude: 1.79279 au
magnitude: 4.55691 debye
