program: Orca
programVersion: 5.0.2
elementType: F F F O O O O O N C C C C C C C C C C C C C C C C C C C C C C H H H H H H H H H H H H H H H H H H H H
charge: 0
multiplicity: 1
keywords: wb97x-d3
keywords: def2-TZVPP
keywords: def2/J RIJCOSX
keywords: DEFGRID2
keywords: scfconv7
keywords: smallprint printgap noloewdin
keywords: NOSOSCF
formula: C22H20F3NO5
InChI: InChI=1/C22H20F3NO5/c1-5-17-13(3)20(30-21(27)28-4)16-11-19(12(2)10-18(16)26-17)29-14-6-8-15(9-7-14)31-22(23,24)25/h6-11H,5H2,1-4H3
51 atoms
F  6.485797 -1.098688 0.235184
F  5.821168 -0.119194 -1.549318
F  6.972191 0.972349 -0.089749
O  -1.994883 1.8782 1.064831
O  0.36068 -2.584135 0.202526
O  -0.234934 3.08986 1.046036
O  4.932251 0.492853 0.398024
O  -0.946484 2.217271 -0.903793
N  -4.742475 -0.711627 -0.629021
C  -2.504751 -0.29092 0.185675
C  -3.476986 -1.126731 -0.39817
C  -4.18423 1.464539 0.238938
C  -5.091502 0.509733 -0.318989
C  -2.9124 1.028016 0.477385
C  -1.207303 -0.784071 0.423161
C  -1.836275 -2.915251 -0.577446
C  -3.108838 -2.440496 -0.759198
C  -0.884386 -2.049811 0.019642
C  -6.528091 0.88108 -0.548721
C  -4.619183 2.870839 0.513078
C  -1.448382 -4.302188 -0.983929
C  -7.372407 0.682694 0.710064
C  1.467365 -1.776464 0.234511
C  1.677534 -0.773288 -0.705434
C  2.409919 -2.033715 1.218011
C  -1.035996 2.389493 0.281041
C  2.844213 -0.028166 -0.657802
C  3.582353 -1.294619 1.259856
C  3.784417 -0.299206 0.322155
C  0.893993 3.698675 0.407462
C  6.027115 0.059053 -0.244024
H  -0.468715 -0.173129 0.925273
H  -3.861057 -3.078108 -1.207117
H  -6.610681 1.915297 -0.886269
H  -6.922438 0.253416 -1.348182
H  -3.828498 3.472105 0.954236
H  -4.932143 3.365354 -0.407641
H  -5.469269 2.898257 1.195289
H  -2.295542 -4.820584 -1.429028
H  -0.638944 -4.295346 -1.715581
H  -1.10666 -4.892988 -0.132671
H  -8.410213 0.956871 0.520231
H  -7.356642 -0.359084 1.031027
H  -7.01637 1.292511 1.540839
H  0.943801 -0.564228 -1.473003
H  2.233396 -2.812433 1.948101
H  3.009845 0.762001 -1.378134
H  4.314223 -1.484617 2.033426
H  1.422291 4.231071 1.19174
H  0.58049 4.40248 -0.361704
H  1.551674 2.944268 -0.023612
elementType: F O N C H
totalener: -1581.01150800 hartree
nucrepener: 3103.99051991 hartree
electener: -4685.00202791 hartree
oneelecener: -8337.39133133 hartree
twoeener: 3652.38930342 hartree
cpcmener: -0.03329733 hartree
kineticenergy: 1574.74442999 hartree
xcener: -144.853089338316 hartree
chargesum: -0.0000000
charge: -0.175175 -0.174066 -0.166533 -0.316885 -0.340909 -0.288793 -0.314753 -0.462402 -0.346397 0.009935 0.103024 -0.044801 0.201458 0.222526 -0.188321 -0.083814 -0.187389 0.270805 -0.142238 -0.263271 -0.240261 -0.270982 0.315265 -0.200605 -0.251220 0.580564 -0.162471 -0.118515 0.199331 -0.117397 0.589356 0.163064 0.115738 0.086292 0.079048 0.101218 0.115603 0.115442 0.098828 0.104102 0.104879 0.095691 0.088126 0.089581 0.159601 0.151758 0.160217 0.157924 0.133167 0.127105 0.117550
qa: -0.1752 -0.1741 -0.1665 -0.3169 -0.3409 -0.2888 -0.3148 -0.4624 -0.3464 0.0099 0.1030 -0.0448 0.2015 0.2225 -0.1883 -0.0838 -0.1874 0.2708 -0.1422 -0.2633 -0.2403 -0.2710 0.3153 -0.2006 -0.2512 0.5806 -0.1625 -0.1185 0.1993 -0.1174 0.5894 0.1631 0.1157 0.0863 0.0790 0.1012 0.1156 0.1154 0.0988 0.1041 0.1049 0.0957 0.0881 0.0896 0.1596 0.1518 0.1602 0.1579 0.1332 0.1271 0.1175
va: 1.1244 1.1252 1.1388 2.1277 2.0840 2.1221 2.0716 2.0281 3.1213 3.7531 3.9642 3.8038 3.7952 3.7083 3.7979 3.8893 4.0972 3.8064 3.8799 3.9105 3.9211 3.9122 3.6603 3.9195 4.0464 4.2639 3.9596 3.9899 3.7285 3.8496 4.6185 1.0065 1.0391 1.0033 1.0248 1.0152 0.9924 0.9939 1.0037 0.9980 0.9957 1.0042 1.0061 1.0019 0.9987 1.0051 0.9966 0.9975 0.9952 0.9927 0.9854
dispcorr: -0.025944243 hartree
energy: -1581.037452244299
dipole: -60.16458 59.88652 -0.27806 4.34169 -3.36228 0.97941 1.96033 -1.21822 0.74210
magnitude: 1.25987 au
magnitude: 3.20234 debye
