program: Orca
programVersion: 5.0.2
elementType: F F F O O O O O N C C C C C C C C C C C C C C C C C C C C C C H H H H H H H H H H H H H H H H H H H H
charge: 0
multiplicity: 1
keywords: wb97x-d3
keywords: def2-TZVPP
keywords: def2/J RIJCOSX
keywords: DEFGRID2
keywords: scfconv7
keywords: smallprint printgap noloewdin
keywords: NOSOSCF
formula: C22H20F3NO5
InChI: InChI=1/C22H20F3NO5/c1-5-17-13(3)20(30-21(27)28-4)16-11-19(12(2)10-18(16)26-17)29-14-6-8-15(9-7-14)31-22(23,24)25/h6-11H,5H2,1-4H3
51 atoms
F  6.812369 1.235182 0.100628
F  5.766662 0.015959 1.537727
F  6.458012 -0.850103 -0.294516
O  -1.859152 1.916871 -1.072937
O  0.361111 -2.627576 -0.362898
O  -0.084526 3.092956 -0.888664
O  4.801484 0.638407 -0.370156
O  -0.985263 2.224788 0.983537
N  -4.736297 -0.687003 0.368367
C  -2.460143 -0.279515 -0.339696
C  -3.473275 -1.123492 0.153177
C  -4.088094 1.521674 -0.34007
C  -5.039659 0.560251 0.133647
C  -2.823968 1.065567 -0.567193
C  -1.164258 -0.786332 -0.551494
C  -1.881144 -2.960858 0.280749
C  -3.150312 -2.466746 0.440324
C  -0.884777 -2.0825 -0.214478
C  -6.449405 1.015353 0.383256
C  -4.48827 2.947003 -0.551164
C  -1.542676 -4.380734 0.609825
C  -7.402957 -0.051037 0.886888
C  1.462455 -1.809712 -0.330576
C  1.657125 -0.897274 0.699868
C  2.397303 -1.94572 -1.343784
C  -0.962686 2.403922 -0.203624
C  2.78697 -0.097618 0.698759
C  3.537616 -1.155276 -1.337389
C  3.711045 -0.231283 -0.324174
C  1.0166 3.645733 -0.15656
C  5.934281 0.254551 0.237141
H  -0.393174 -0.157774 -0.976845
H  -3.934087 -3.113501 0.815177
H  -6.422222 1.847664 1.094211
H  -6.840532 1.452439 -0.541115
H  -3.67249 3.559736 -0.925934
H  -5.310988 3.020675 -1.263895
H  -4.836104 3.394896 0.381174
H  -1.177547 -4.922711 -0.264015
H  -0.765866 -4.442419 1.373428
H  -2.419932 -4.905643 0.983247
H  -8.390113 0.385039 1.040033
H  -7.511488 -0.870392 0.177102
H  -7.078357 -0.474063 1.836816
H  0.930959 -0.792996 1.495364
H  2.237768 -2.661422 -2.139356
H  2.931114 0.633771 1.482811
H  4.261617 -1.244683 -2.136275
H  1.622029 2.855642 0.28703
H  0.675309 4.332046 0.61659
H  1.610147 4.188308 -0.885354
elementType: F O N C H
totalener: -1581.01159839 hartree
nucrepener: 3111.92414267 hartree
electener: -4692.93574106 hartree
oneelecener: -8353.34972690 hartree
twoeener: 3660.41398584 hartree
cpcmener: -0.03341309 hartree
kineticenergy: 1574.75479332 hartree
xcener: -144.856650871299 hartree
chargesum: -0.0000000
charge: -0.166918 -0.173788 -0.174540 -0.318868 -0.343607 -0.288799 -0.315659 -0.464318 -0.361560 0.010206 0.077102 -0.029019 0.179165 0.227058 -0.173180 -0.071297 -0.191283 0.256157 -0.095391 -0.260352 -0.238643 -0.273469 0.298145 -0.191072 -0.235826 0.581696 -0.167740 -0.125128 0.208321 -0.118052 0.588931 0.159616 0.117819 0.089827 0.090912 0.100771 0.112932 0.113498 0.104639 0.103255 0.099108 0.094983 0.077891 0.077834 0.159575 0.151584 0.160606 0.157763 0.118115 0.127562 0.133439
qa: -0.1669 -0.1738 -0.1745 -0.3189 -0.3436 -0.2888 -0.3157 -0.4643 -0.3616 0.0102 0.0771 -0.0290 0.1792 0.2271 -0.1732 -0.0713 -0.1913 0.2562 -0.0954 -0.2604 -0.2386 -0.2735 0.2981 -0.1911 -0.2358 0.5817 -0.1677 -0.1251 0.2083 -0.1181 0.5889 0.1596 0.1178 0.0898 0.0909 0.1008 0.1129 0.1135 0.1046 0.1033 0.0991 0.0950 0.0779 0.0778 0.1596 0.1516 0.1606 0.1578 0.1181 0.1276 0.1334
va: 1.1383 1.1259 1.1252 2.1257 2.0794 2.1218 2.0679 2.0249 3.0940 3.7660 4.0174 3.8610 3.8048 3.6895 3.7897 3.8746 4.0697 3.8131 3.8281 3.9101 3.9200 3.9566 3.6736 3.9205 4.0431 4.2639 3.9547 3.9961 3.7162 3.8470 4.6206 1.0111 1.0351 1.0002 1.0007 1.0147 0.9966 0.9935 0.9958 0.9982 1.0037 1.0048 1.0080 1.0082 0.9969 1.0042 0.9961 0.9974 0.9853 0.9935 0.9951
dispcorr: -0.025853096 hartree
energy: -1581.037451488086
dipole: -59.59647 59.42570 -0.17077 1.59541 -0.63532 0.96009 1.58647 -2.19719 -0.61072
magnitude: 1.15061 au
magnitude: 2.92463 debye
