program: Orca
programVersion: 5.0.2
elementType: F F F O O O O O N C C C C C C C C C C C C C C C C C C C C C C H H H H H H H H H H H H H H H H H H H H
charge: 0
multiplicity: 1
keywords: wb97x-d3
keywords: def2-TZVPP
keywords: def2/J RIJCOSX
keywords: DEFGRID2
keywords: scfconv7
keywords: smallprint printgap noloewdin
keywords: NOSOSCF
formula: C22H20F3NO5
InChI: InChI=1/C22H20F3NO5/c1-5-17-13(3)20(30-21(27)28-4)16-11-19(12(2)10-18(16)26-17)29-14-6-8-15(9-7-14)31-22(23,24)25/h6-11H,5H2,1-4H3
51 atoms
F  6.254528 -1.391188 -0.715413
F  5.415668 -0.041604 -2.150829
F  7.020575 0.616502 -0.876068
O  -2.259114 1.794907 1.736541
O  0.394505 -2.461709 0.750521
O  -1.048569 2.294642 -0.038142
O  5.076502 0.354443 0.014907
O  -0.54662 3.158287 1.974487
N  -4.641058 -0.6923 -0.560465
C  -2.539576 -0.280817 0.563056
C  -3.393989 -1.085277 -0.217827
C  -4.283846 1.40954 0.55952
C  -5.073882 0.484796 -0.192498
C  -3.037026 0.989473 0.924931
C  -1.26279 -0.757762 0.913136
C  -1.666855 -2.79078 -0.370335
C  -2.929721 -2.341878 -0.659629
C  -0.844166 -1.966917 0.433944
C  -6.458449 0.860429 -0.635628
C  -4.824421 2.755561 0.929795
C  -1.158818 -4.103348 -0.877638
C  -6.45273 1.555317 -1.996188
C  1.511137 -1.700219 0.551897
C  1.583393 -0.688567 -0.399018
C  2.617368 -2.017105 1.329659
C  -1.214358 2.475437 1.248076
C  2.775721 -0.004929 -0.579605
C  3.810366 -1.341147 1.139705
C  3.878524 -0.344733 0.182503
C  0.082824 2.934385 -0.644264
C  5.919716 -0.116168 -0.917623
H  -0.60633 -0.183989 1.555311
H  -3.592675 -2.948557 -1.264179
H  -7.056235 -0.049132 -0.701109
H  -6.938987 1.502411 0.103593
H  -4.072367 3.398694 1.379569
H  -5.215692 3.276134 0.056024
H  -5.646009 2.663865 1.642336
H  -0.884383 -4.775536 -0.063556
H  -1.917691 -4.600773 -1.478799
H  -0.271941 -3.974028 -1.500107
H  -7.468033 1.817076 -2.294042
H  -5.865112 2.473956 -1.982945
H  -6.037297 0.904964 -2.765986
H  0.730578 -0.423433 -1.009497
H  2.549025 -2.798016 2.075746
H  2.830494 0.789536 -1.312232
H  4.671692 -1.583898 1.747844
H  -0.010476 4.017808 -0.59174
H  0.076307 2.618664 -1.682344
H  1.011285 2.617488 -0.171901
elementType: F O N C H
totalener: -1581.00893051 hartree
nucrepener: 3116.61271070 hartree
electener: -4697.62164120 hartree
oneelecener: -8361.57497556 hartree
twoeener: 3663.95333435 hartree
cpcmener: -0.03643653 hartree
kineticenergy: 1574.76493737 hartree
xcener: -144.857078852992 hartree
chargesum: -0.0000000
charge: -0.174191 -0.175239 -0.166236 -0.309554 -0.339894 -0.262663 -0.315213 -0.463409 -0.349974 0.019034 0.126720 -0.039725 0.201009 0.238698 -0.172952 -0.057925 -0.201212 0.205587 -0.144847 -0.257452 -0.242469 -0.272158 0.325083 -0.187481 -0.267199 0.545000 -0.165214 -0.118109 0.182313 -0.135012 0.590143 0.163395 0.115139 0.079294 0.087179 0.100612 0.114146 0.114345 0.106836 0.098975 0.104709 0.096106 0.089363 0.087338 0.161226 0.149840 0.159470 0.158087 0.141368 0.134573 0.122541
qa: -0.1742 -0.1752 -0.1662 -0.3096 -0.3399 -0.2627 -0.3152 -0.4634 -0.3500 0.0190 0.1267 -0.0397 0.2010 0.2387 -0.1730 -0.0579 -0.2012 0.2056 -0.1448 -0.2575 -0.2425 -0.2722 0.3251 -0.1875 -0.2672 0.5450 -0.1652 -0.1181 0.1823 -0.1350 0.5901 0.1634 0.1151 0.0793 0.0872 0.1006 0.1141 0.1143 0.1068 0.0990 0.1047 0.0961 0.0894 0.0873 0.1612 0.1498 0.1595 0.1581 0.1414 0.1346 0.1225
va: 1.1249 1.1238 1.1393 2.1307 2.0800 2.0999 2.0731 2.0457 3.1152 3.6935 3.9342 3.8043 3.7867 3.7231 3.8478 3.8816 4.1023 3.8346 3.8817 3.9133 3.9218 3.9159 3.6651 3.8770 4.0360 4.3204 3.9915 3.9918 3.7467 3.8205 4.6142 1.0072 1.0404 1.0226 1.0031 1.0145 0.9914 0.9943 0.9958 1.0038 0.9966 1.0040 1.0011 1.0078 0.9950 1.0068 0.9990 0.9959 0.9943 0.9914 0.9903
dispcorr: -0.026754118 hartree
energy: -1581.035684624591
dipole: -58.18635 57.15947 -1.02687 5.68963 -5.48911 0.20053 -4.18742 2.94975 -1.23767
magnitude: 1.62065 au
magnitude: 4.11936 debye
