program: Orca
programVersion: 5.0.2
elementType: F F F O O O O O N C C C C C C C C C C C C C C C C C C C C C C H H H H H H H H H H H H H H H H H H H H
charge: 0
multiplicity: 1
keywords: wb97x-d3
keywords: def2-TZVPP
keywords: def2/J RIJCOSX
keywords: DEFGRID2
keywords: scfconv7
keywords: smallprint printgap noloewdin
keywords: NOSOSCF
formula: C22H20F3NO5
InChI: InChI=1/C22H20F3NO5/c1-5-17-13(3)20(30-21(27)28-4)16-11-19(12(2)10-18(16)26-17)29-14-6-8-15(9-7-14)31-22(23,24)25/h6-11H,5H2,1-4H3
51 atoms
F  5.579542 0.611982 0.832451
F  6.768869 0.743279 -0.959963
F  4.763013 1.531574 -0.922105
O  -1.784406 1.955332 0.939149
O  0.311532 -2.686505 0.756141
O  0.031539 3.073618 0.789873
O  5.140579 -0.659799 -0.939084
O  -0.710823 2.007503 -1.047349
N  -4.635644 -0.670394 -0.509545
C  -2.405409 -0.273453 0.332186
C  -3.407474 -1.121202 -0.181977
C  -3.978038 1.558585 0.120337
C  -4.917863 0.594146 -0.359527
C  -2.736583 1.092593 0.446097
C  -1.152523 -0.810773 0.677763
C  -1.876278 -3.007611 -0.087797
C  -3.111374 -2.487634 -0.372323
C  -0.899017 -2.132684 0.444879
C  -6.327514 1.000645 -0.688069
C  -4.342364 3.008918 0.22467
C  -1.547853 -4.450392 -0.319918
C  -7.229731 0.916071 0.543146
C  1.463268 -2.115658 0.313832
C  2.616619 -2.430847 1.021848
C  1.535151 -1.298938 -0.809696
C  -0.800811 2.320062 0.101339
C  3.839846 -1.932155 0.611955
C  2.762318 -0.798716 -1.215145
C  3.904512 -1.115111 -0.50282
C  1.193946 3.515688 0.09645
C  5.548776 0.536293 -0.4986
H  -0.386123 -0.191633 1.125625
H  -3.894978 -3.117257 -0.774161
H  -6.359959 2.007934 -1.107487
H  -6.700496 0.322533 -1.455505
H  -3.59535 3.581451 0.768297
H  -4.446827 3.457929 -0.765126
H  -5.292596 3.144803 0.740826
H  -1.260524 -4.952406 0.604393
H  -2.404925 -4.977233 -0.735114
H  -0.715762 -4.564901 -1.015913
H  -6.891762 1.575434 1.343762
H  -8.254208 1.194132 0.295689
H  -7.241725 -0.099945 0.936195
H  2.54988 -3.070843 1.891218
H  0.648883 -1.041791 -1.373509
H  4.740136 -2.184956 1.155267
H  2.821471 -0.177677 -2.098648
H  0.937898 4.107229 -0.78221
H  1.818854 2.676132 -0.209609
H  1.741205 4.132519 0.803127
totalener: -1581.00201142 hartree
nucrepener: 3128.83779374 hartree
electener: -4709.83980516 hartree
oneelecener: -8386.30662123 hartree
twoeener: 3676.46681607 hartree
kineticenergy: 1574.85220491 hartree
xcener: -144.866743273591 hartree
chargesum: 0.0000000
charge: -0.170403 -0.155161 -0.177495 -0.306189 -0.306883 -0.263353 -0.294100 -0.353280 -0.288227 0.044018 0.073574 -0.042842 0.194234 0.238231 -0.155719 -0.038747 -0.154830 0.179450 -0.157393 -0.276626 -0.223701 -0.257219 0.293262 -0.235522 -0.176739 0.473338 -0.082727 -0.145779 0.167955 -0.116247 0.577192 0.143143 0.103944 0.073987 0.088694 0.100665 0.110471 0.101198 0.102042 0.086673 0.094411 0.073256 0.087102 0.097392 0.127482 0.143526 0.127067 0.135588 0.112971 0.106577 0.121738
qa: -0.1704 -0.1552 -0.1775 -0.3062 -0.3069 -0.2634 -0.2941 -0.3533 -0.2882 0.0440 0.0736 -0.0428 0.1942 0.2382 -0.1557 -0.0387 -0.1548 0.1794 -0.1574 -0.2766 -0.2237 -0.2572 0.2933 -0.2355 -0.1767 0.4733 -0.0827 -0.1458 0.1680 -0.1162 0.5772 0.1431 0.1039 0.0740 0.0887 0.1007 0.1105 0.1012 0.1020 0.0867 0.0944 0.0733 0.0871 0.0974 0.1275 0.1435 0.1271 0.1356 0.1130 0.1066 0.1217
va: 1.1304 1.1555 1.1204 2.1278 2.1130 2.1277 2.1026 2.1405 3.1363 3.7668 4.0999 3.7916 3.7976 3.7555 3.8447 3.8613 4.0816 3.8991 3.8765 3.9116 3.9367 3.9140 3.7621 4.0608 3.9046 4.3619 4.0093 4.0147 3.8351 3.8892 4.6252 1.0089 1.0404 1.0030 1.0257 1.0168 0.9911 0.9978 0.9974 1.0057 1.0002 1.0056 1.0062 1.0075 1.0145 1.0081 1.0067 1.0072 0.9939 0.9943 0.9958
dispcorr: -0.025994640 hartree
energy: -1581.028006058163
dipole: -55.51687 55.09701 -0.41986 -0.65819 1.03051 0.37231 1.13837 -0.84415 0.29423
magnitude: 0.63361 au
magnitude: 1.61052 debye
