program: Orca
programVersion: 5.0.2
elementType: F F F O O O O O N C C C C C C C C C C C C C C C C C C C C C C H H H H H H H H H H H H H H H H H H H H
charge: 0
multiplicity: 1
keywords: wb97x-d3
keywords: def2-TZVPP
keywords: def2/J RIJCOSX
keywords: DEFGRID2
keywords: scfconv7
keywords: smallprint printgap noloewdin
keywords: NOSOSCF
formula: C22H20F3NO5
InChI: InChI=1/C22H20F3NO5/c1-5-17-13(3)20(30-21(27)28-4)16-11-19(12(2)10-18(16)26-17)29-14-6-8-15(9-7-14)31-22(23,24)25/h6-11H,5H2,1-4H3
51 atoms
F  4.804742 1.565209 -0.775824
F  5.594667 0.609582 0.971311
F  6.801252 0.753704 -0.808161
O  -1.730666 2.050829 0.880041
O  0.280556 -2.645472 0.742446
O  0.154712 3.029122 0.627513
O  5.156311 -0.630002 -0.823634
O  -0.718953 1.940423 -1.136721
N  -4.698427 -0.581982 -0.296318
C  -2.41275 -0.190755 0.38413
C  -3.453734 -1.038236 -0.04239
C  -3.976574 1.653516 0.223525
C  -4.959919 0.685437 -0.159029
C  -2.720799 1.184422 0.477089
C  -1.150453 -0.737522 0.677194
C  -1.943774 -2.942986 0.013117
C  -3.185994 -2.412313 -0.21474
C  -0.927634 -2.069569 0.469939
C  -6.368823 1.140641 -0.431516
C  -4.334309 3.104588 0.317791
C  -1.649119 -4.396486 -0.196224
C  -7.316804 0.034746 -0.859519
C  1.442123 -2.066371 0.339223
C  1.545095 -1.248194 -0.780934
C  2.575069 -2.383565 1.078026
C  -0.749575 2.307224 -0.001015
C  2.784423 -0.752837 -1.154548
C  3.810811 -1.890468 0.699691
C  3.907449 -1.07513 -0.41403
C  1.319116 3.363537 -0.12112
C  5.574949 0.554143 -0.360591
H  -0.355291 -0.119784 1.073526
H  -4.000025 -3.040865 -0.552763
H  -6.757495 1.634131 0.466139
H  -6.346241 1.925716 -1.194969
H  -5.176539 3.258994 0.993745
H  -3.50959 3.710772 0.682423
H  -4.631818 3.499887 -0.65528
H  -2.53333 -4.919424 -0.555814
H  -0.853396 -4.543117 -0.927768
H  -1.325514 -4.879602 0.726238
H  -8.312529 0.44317 -1.031541
H  -6.981532 -0.443657 -1.777916
H  -7.393621 -0.741369 -0.100342
H  0.673989 -0.98923 -1.367249
H  2.48327 -3.02389 1.944945
H  2.869929 -0.134112 -2.037745
H  4.69576 -2.148053 1.265408
H  1.883725 2.472276 -0.396516
H  1.923071 3.982845 0.535197
H  1.072042 3.921735 -1.023794
totalener: -1581.00265790 hartree
nucrepener: 3131.69872918 hartree
electener: -4712.70138708 hartree
oneelecener: -8392.05717038 hartree
twoeener: 3679.35578331 hartree
kineticenergy: 1574.84697595 hartree
xcener: -144.868132543847 hartree
chargesum: -0.0000000
charge: -0.177710 -0.169746 -0.154709 -0.304127 -0.307837 -0.262333 -0.294038 -0.351464 -0.308688 0.051955 0.057687 -0.054108 0.172389 0.255598 -0.169319 -0.049410 -0.152827 0.204479 -0.121173 -0.258638 -0.223783 -0.239832 0.305319 -0.189839 -0.239495 0.468496 -0.156730 -0.079101 0.174077 -0.110276 0.576608 0.144584 0.106028 0.076330 0.074737 0.097187 0.098419 0.104018 0.086769 0.094391 0.100981 0.082154 0.083192 0.082205 0.147253 0.127689 0.139730 0.127281 0.099966 0.121865 0.113797
qa: -0.1777 -0.1697 -0.1547 -0.3041 -0.3078 -0.2623 -0.2940 -0.3515 -0.3087 0.0520 0.0577 -0.0541 0.1724 0.2556 -0.1693 -0.0494 -0.1528 0.2045 -0.1212 -0.2586 -0.2238 -0.2398 0.3053 -0.1898 -0.2395 0.4685 -0.1567 -0.0791 0.1741 -0.1103 0.5766 0.1446 0.1060 0.0763 0.0747 0.0972 0.0984 0.1040 0.0868 0.0944 0.1010 0.0822 0.0832 0.0822 0.1473 0.1277 0.1397 0.1273 0.1000 0.1219 0.1138
va: 1.1194 1.1313 1.1561 2.1288 2.1160 2.1286 2.1031 2.1411 3.0989 3.7759 4.1405 3.8588 3.7905 3.7383 3.8439 3.8628 4.0522 3.8870 3.8678 3.9128 3.9373 3.9598 3.7542 3.9108 4.0652 4.3684 3.9980 4.0052 3.8295 3.8907 4.6257 1.0074 1.0356 1.0026 1.0013 0.9998 1.0179 0.9950 1.0056 1.0004 0.9975 1.0037 1.0119 1.0125 1.0071 1.0147 1.0053 1.0068 0.9930 0.9966 0.9946
dispcorr: -0.026022598 hartree
energy: -1581.028680493025
dipole: -55.92510 55.60126 -0.32383 -2.67761 3.01531 0.33770 -2.53787 2.77825 0.24039
magnitude: 0.52602 au
magnitude: 1.33704 debye
