program: Orca
programVersion: 5.0.2
elementType: F F F O O O O O N C C C C C C C C C C C C C C C C C C C C C C H H H H H H H H H H H H H H H H H H H H
charge: 0
multiplicity: 1
keywords: wb97x-d3
keywords: def2-TZVPP
keywords: def2/J RIJCOSX
keywords: DEFGRID2
keywords: scfconv7
keywords: smallprint printgap noloewdin
keywords: NOSOSCF
formula: C22H20F3NO5
InChI: InChI=1/C22H20F3NO5/c1-5-17-13(3)20(30-21(27)28-4)16-11-19(12(2)10-18(16)26-17)29-14-6-8-15(9-7-14)31-22(23,24)25/h6-11H,5H2,1-4H3
51 atoms
F  6.042411 -0.905684 -1.58982
F  7.136364 0.671788 -0.60925
F  6.635415 -1.130985 0.455482
O  -1.984189 1.90383 1.03882
O  0.443447 -2.55157 0.37385
O  -0.598954 3.511193 0.785074
O  5.080149 0.382031 -0.052462
O  -1.793339 2.849803 -1.002474
N  -4.749156 -0.88861 -0.229779
C  -2.467901 -0.313958 0.329727
C  -3.454574 -1.23023 -0.087243
C  -4.228536 1.355403 0.451274
C  -5.130718 0.334392 0.025472
C  -2.915223 0.996421 0.584837
C  -1.131145 -0.740441 0.481219
C  -1.7779 -2.983041 -0.230969
C  -3.071406 -2.561002 -0.361719
C  -0.809195 -2.04037 0.204521
C  -6.591987 0.622789 -0.187134
C  -4.677556 2.759416 0.724437
C  -1.372704 -4.394428 -0.525791
C  -6.858488 1.360808 -1.497415
C  1.550927 -1.766652 0.266942
C  1.806408 -1.016149 -0.874409
C  2.468527 -1.795856 1.305572
C  -1.484396 2.771248 0.147796
C  2.996321 -0.316672 -0.98081
C  3.65899 -1.094283 1.199597
C  3.917023 -0.364998 0.053115
C  0.063535 4.49987 0.007015
C  6.200034 -0.245549 -0.444038
H  -0.376386 -0.050104 0.834437
H  -3.84396 -3.246243 -0.686451
H  -7.110978 -0.335167 -0.198376
H  -7.002821 1.192646 0.64998
H  -4.549227 3.389687 -0.157714
H  -5.727695 2.80245 1.003905
H  -4.110863 3.212434 1.5370
H  -0.961267 -4.888742 0.355041
H  -2.228185 -4.974742 -0.866339
H  -0.607111 -4.439096 -1.301267
H  -6.372703 2.336155 -1.526959
H  -6.490728 0.782694 -2.344631
H  -7.927398 1.520153 -1.639825
H  1.088308 -0.989048 -1.683705
H  2.253917 -2.377492 2.191802
H  3.207801 0.265178 -1.867875
H  4.369756 -1.10763 2.014188
H  0.641596 4.051116 -0.800633
H  0.733833 5.013026 0.690203
H  -0.640616 5.214795 -0.418419
totalener: -1581.00163799 hartree
nucrepener: 3061.93354850 hartree
electener: -4642.93518649 hartree
oneelecener: -8252.54775821 hartree
twoeener: 3609.61257172 hartree
kineticenergy: 1574.83153268 hartree
xcener: -144.862081221569 hartree
chargesum: 0.0000000
charge: -0.166730 -0.155909 -0.171845 -0.307845 -0.310144 -0.264224 -0.295902 -0.356438 -0.283713 -0.024217 0.065128 -0.016856 0.200871 0.241790 -0.109805 -0.041276 -0.146032 0.174347 -0.168854 -0.317644 -0.220555 -0.259358 0.244828 -0.157020 -0.202861 0.481726 -0.120490 -0.087815 0.163402 -0.126067 0.575458 0.139200 0.102144 0.088996 0.076296 0.120819 0.105355 0.113307 0.098037 0.087180 0.093707 0.083099 0.096192 0.084076 0.138931 0.129906 0.130322 0.129280 0.112574 0.122364 0.112262
qa: -0.1667 -0.1559 -0.1718 -0.3078 -0.3101 -0.2642 -0.2959 -0.3564 -0.2837 -0.0242 0.0651 -0.0169 0.2009 0.2418 -0.1098 -0.0413 -0.1460 0.1743 -0.1689 -0.3176 -0.2206 -0.2594 0.2448 -0.1570 -0.2029 0.4817 -0.1205 -0.0878 0.1634 -0.1261 0.5755 0.1392 0.1021 0.0890 0.0763 0.1208 0.1054 0.1133 0.0980 0.0872 0.0937 0.0831 0.0962 0.0841 0.1389 0.1299 0.1303 0.1293 0.1126 0.1224 0.1123
va: 1.1353 1.1540 1.1303 2.1279 2.0980 2.1262 2.1000 2.1434 3.1464 3.8649 4.1001 3.7685 3.7870 3.7491 3.7877 3.8431 4.0837 3.9084 3.8543 3.8884 3.9355 3.9165 3.8129 3.9790 4.0603 4.3599 4.0193 4.0104 3.8587 3.8890 4.6319 1.0222 1.0405 1.0298 1.0040 0.9913 1.0033 1.0047 0.9984 1.0054 1.0012 1.0022 1.0053 1.0061 1.0027 1.0126 1.0064 1.0090 0.9934 0.9948 0.9935
dispcorr: -0.024730609 hartree
energy: -1581.026368597031
dipole: -61.28347 60.97124 -0.31222 8.54118 -7.87145 0.66973 -1.76316 2.08776 0.32459
magnitude: 0.80709 au
magnitude: 2.05145 debye
