program: Orca
programVersion: 5.0.2
elementType: F F F O O O O O N C C C C C C C C C C C C C C C C C C C C C C H H H H H H H H H H H H H H H H H H H H
charge: 0
multiplicity: 1
keywords: wb97x-d3
keywords: def2-TZVPP
keywords: def2/J RIJCOSX
keywords: DEFGRID2
keywords: scfconv7
keywords: smallprint printgap noloewdin
keywords: NOSOSCF
formula: C22H20F3NO5
InChI: InChI=1/C22H20F3NO5/c1-5-17-13(3)20(30-21(27)28-4)16-11-19(12(2)10-18(16)26-17)29-14-6-8-15(9-7-14)31-22(23,24)25/h6-11H,5H2,1-4H3
51 atoms
F  4.657516 1.623553 -0.418435
F  4.057055 1.400887 1.625875
F  6.14963 1.418415 1.123114
O  -1.238885 1.876816 0.13217
O  0.346662 -2.834869 -0.920183
O  0.091695 3.153707 -0.950015
O  5.008937 -0.326998 0.589767
O  -1.899563 2.667711 -1.876881
N  -4.508787 -0.635709 0.417875
C  -2.159215 -0.304805 -0.033422
C  -3.299852 -1.123237 0.071323
C  -3.562265 1.56801 0.598807
C  -4.642815 0.634236 0.6761
C  -2.349062 1.067943 0.225845
C  -0.915865 -0.871057 -0.372967
C  -1.964837 -3.064905 -0.534262
C  -3.16765 -2.50198 -0.200836
C  -0.829917 -2.217273 -0.601277
C  -6.012258 1.126182 1.064959
C  -3.773316 3.022016 0.88737
C  -1.825741 -4.529596 -0.814819
C  -7.099177 0.067662 1.015164
C  1.508004 -2.228142 -0.536921
C  2.400336 -1.80593 -1.507814
C  1.796144 -2.051493 0.810639
C  -1.09562 2.583237 -0.999011
C  3.576558 -1.172684 -1.132989
C  2.963624 -1.413029 1.185121
C  3.837189 -0.962885 0.208706
C  0.448167 3.94802 -2.074434
C  4.95911 1.007663 0.726408
H  -0.0372 -0.243374 -0.431466
H  -4.057615 -3.114049 -0.126725
H  -5.960803 1.551667 2.073587
H  -6.282703 1.966687 0.41739
H  -2.84172 3.532765 1.121703
H  -4.222243 3.529304 0.030922
H  -4.439763 3.166035 1.736496
H  -2.78479 -5.033033 -0.707516
H  -1.463936 -4.712324 -1.827411
H  -1.118557 -5.005862 -0.134677
H  -6.88473 -0.757393 1.691651
H  -8.056575 0.503483 1.300761
H  -7.200915 -0.351527 0.015729
H  2.170583 -1.96243 -2.553231
H  1.100048 -2.396178 1.563831
H  4.280171 -0.840964 -1.884176
H  3.194953 -1.270212 2.231698
H  1.444216 4.326375 -1.864263
H  -0.238391 4.783723 -2.209768
H  0.468951 3.358084 -2.990724
totalener: -1581.00165088 hartree
nucrepener: 3129.39063960 hartree
electener: -4710.39229048 hartree
oneelecener: -8387.73478629 hartree
twoeener: 3677.34249581 hartree
kineticenergy: 1574.85370760 hartree
xcener: -144.867616045558 hartree
chargesum: 0.0000000
charge: -0.172649 -0.167501 -0.154634 -0.310760 -0.314597 -0.262940 -0.295694 -0.353845 -0.309894 -0.023174 0.034338 -0.012379 0.189476 0.246801 -0.100424 -0.028376 -0.151808 0.168322 -0.125420 -0.285961 -0.214014 -0.240228 0.215002 -0.173326 -0.139203 0.479091 -0.115745 -0.117716 0.180053 -0.128114 0.577713 0.138822 0.103808 0.073474 0.078863 0.097879 0.121534 0.101490 0.086208 0.098179 0.092461 0.081130 0.081104 0.082627 0.129900 0.133876 0.128526 0.128740 0.123980 0.112614 0.112391
qa: -0.1726 -0.1675 -0.1546 -0.3108 -0.3146 -0.2629 -0.2957 -0.3538 -0.3099 -0.0232 0.0343 -0.0124 0.1895 0.2468 -0.1004 -0.0284 -0.1518 0.1683 -0.1254 -0.2860 -0.2140 -0.2402 0.2150 -0.1733 -0.1392 0.4791 -0.1157 -0.1177 0.1801 -0.1281 0.5777 0.1388 0.1038 0.0735 0.0789 0.0979 0.1215 0.1015 0.0862 0.0982 0.0925 0.0811 0.0811 0.0826 0.1299 0.1339 0.1285 0.1287 0.1240 0.1126 0.1124
va: 1.1287 1.1350 1.1561 2.1282 2.0995 2.1262 2.1014 2.1461 3.1054 3.8759 4.1584 3.8456 3.7589 3.7460 3.7565 3.8375 4.0623 3.8910 3.8783 3.9085 3.9339 3.9603 3.8575 4.0230 3.9827 4.3632 4.0202 4.0244 3.8495 3.8887 4.6264 1.0249 1.0348 1.0023 0.9984 1.0114 0.9926 1.0008 1.0055 0.9982 1.0018 1.0128 1.0040 1.0119 1.0102 1.0029 1.0078 1.0083 0.9944 0.9933 0.9934
dispcorr: -0.024748306 hartree
energy: -1581.026399183530
dipole: -52.49631 52.64883 0.15252 -4.50073 4.75903 0.25829 -3.96664 3.87174 -0.09489
magnitude: 0.31461 au
magnitude: 0.79968 debye
