program: Orca
programVersion: 5.0.2
elementType: F F F O O O O O N C C C C C C C C C C C C C C C C C C C C C C H H H H H H H H H H H H H H H H H H H H
charge: 0
multiplicity: 1
keywords: wb97x-d3
keywords: def2-TZVPP
keywords: def2/J RIJCOSX
keywords: DEFGRID2
keywords: scfconv7
keywords: smallprint printgap noloewdin
keywords: NOSOSCF
formula: C22H20F3NO5
InChI: InChI=1/C22H20F3NO5/c1-5-17-13(3)20(30-21(27)28-4)16-11-19(12(2)10-18(16)26-17)29-14-6-8-15(9-7-14)31-22(23,24)25/h6-11H,5H2,1-4H3
51 atoms
F  6.621869 -1.421603 0.299395
F  5.927364 -1.160478 -1.711387
F  7.18838 0.335134 -0.804013
O  -1.986005 2.002641 0.859459
O  0.401571 -2.49514 0.580152
O  -0.671627 3.681716 0.732328
O  5.149496 0.194202 -0.13003
O  -1.727573 3.021044 -1.140583
N  -4.67515 -0.77825 -0.597203
C  -2.451054 -0.224135 0.173828
C  -3.408859 -1.138242 -0.312248
C  -4.184205 1.472837 0.090752
C  -5.053665 0.456243 -0.405986
C  -2.893523 1.102314 0.349822
C  -1.146115 -0.669008 0.46904
C  -1.76053 -2.92237 -0.23621
C  -3.026771 -2.482509 -0.508719
C  -0.823442 -1.982223 0.264039
C  -6.49984 0.753313 -0.693931
C  -4.662659 2.87932 0.292774
C  -1.355566 -4.348941 -0.447541
C  -7.366607 0.561068 0.550447
C  1.537246 -1.770893 0.391408
C  1.774239 -1.049907 -0.773199
C  2.501358 -1.828564 1.386761
C  -1.481461 2.920959 0.023022
C  2.988501 -0.408142 -0.944734
C  3.716079 -1.186164 1.213648
C  3.953412 -0.485287 0.045256
C  -0.032765 4.73977 0.028345
C  6.198912 -0.510959 -0.580411
H  -0.414317 0.018823 0.871982
H  -3.776321 -3.164027 -0.89027
H  -6.623128 1.763891 -1.087747
H  -6.831226 0.066608 -1.472688
H  -4.616198 3.445451 -0.639463
H  -5.693038 2.906231 0.641497
H  -4.06703 3.411139 1.032738
H  -2.185497 -4.926888 -0.849719
H  -0.52143 -4.430663 -1.145584
H  -1.037853 -4.820739 0.482838
H  -7.289627 -0.463877 0.911677
H  -7.06416 1.22032 1.36528
H  -8.414913 0.763915 0.331359
H  1.022374 -0.995888 -1.549598
H  2.301233 -2.385138 2.292251
H  3.18335 0.151163 -1.849854
H  4.46363 -1.222518 1.993921
H  0.5911 4.364088 -0.782294
H  0.589502 5.247034 0.759647
H  -0.758479 5.442161 -0.381909
totalener: -1581.00182772 hartree
nucrepener: 3053.81808499 hartree
electener: -4634.81991270 hartree
oneelecener: -8236.33458270 hartree
twoeener: 3601.51467000 hartree
kineticenergy: 1574.83957991 hartree
xcener: -144.864017522412 hartree
chargesum: -0.0000000
charge: -0.171950 -0.167010 -0.156052 -0.306587 -0.311782 -0.263785 -0.296109 -0.354360 -0.289884 -0.011695 0.065163 0.003271 0.206207 0.223268 -0.122872 -0.038473 -0.148307 0.167014 -0.160867 -0.297326 -0.222786 -0.259178 0.262409 -0.162789 -0.221932 0.478631 -0.114546 -0.079437 0.153485 -0.126767 0.575482 0.140518 0.102308 0.076137 0.087864 0.127587 0.100963 0.100488 0.087125 0.093849 0.099954 0.097045 0.073755 0.086544 0.138858 0.129447 0.130108 0.128604 0.113830 0.122477 0.112103
qa: -0.1720 -0.1670 -0.1561 -0.3066 -0.3118 -0.2638 -0.2961 -0.3544 -0.2899 -0.0117 0.0652 0.0033 0.2062 0.2233 -0.1229 -0.0385 -0.1483 0.1670 -0.1609 -0.2973 -0.2228 -0.2592 0.2624 -0.1628 -0.2219 0.4786 -0.1145 -0.0794 0.1535 -0.1268 0.5755 0.1405 0.1023 0.0761 0.0879 0.1276 0.1010 0.1005 0.0871 0.0938 0.1000 0.0970 0.0738 0.0865 0.1389 0.1294 0.1301 0.1286 0.1138 0.1225 0.1121
va: 1.1301 1.1348 1.1540 2.1292 2.0999 2.1267 2.0994 2.1460 3.1371 3.8143 4.1024 3.7644 3.7713 3.7821 3.8037 3.8431 4.0830 3.9058 3.8810 3.8988 3.9371 3.9120 3.7966 3.9580 4.0632 4.3644 4.0231 4.0069 3.8651 3.8879 4.6316 1.0204 1.0409 1.0006 1.0263 0.9910 1.0012 1.0085 1.0054 1.0010 0.9979 1.0076 1.0051 1.0063 1.0030 1.0136 1.0066 1.0086 0.9937 0.9947 0.9930
dispcorr: -0.024545261 hartree
energy: -1581.026372975980
dipole: -62.47335 61.99024 -0.48311 8.83998 -8.10399 0.73599 3.25705 -2.83046 0.42659
magnitude: 0.97829 au
magnitude: 2.48662 debye
