program: Orca
programVersion: 5.0.2
elementType: F F F O O O O O N C C C C C C C C C C C C C C C C C C C C C C H H H H H H H H H H H H H H H H H H H H
charge: 0
multiplicity: 1
keywords: wb97x-d3
keywords: def2-TZVPP
keywords: def2/J RIJCOSX
keywords: DEFGRID2
keywords: scfconv7
keywords: smallprint printgap noloewdin
keywords: NOSOSCF
formula: C22H20F3NO5
InChI: InChI=1/C22H20F3NO5/c1-5-17-13(3)20(30-21(27)28-4)16-11-19(12(2)10-18(16)26-17)29-14-6-8-15(9-7-14)31-22(23,24)25/h6-11H,5H2,1-4H3
51 atoms
F  7.184683 -2.454192 1.893199
F  5.191539 -3.264661 1.735832
F  6.319283 -2.858433 -0.038757
O  -2.658796 2.819202 0.200129
O  1.06274 0.000256 -1.654599
O  -2.369537 4.730796 -0.713789
O  5.623654 -1.148032 1.204872
O  -3.83279 3.311394 -1.664746
N  -3.978693 -1.097465 0.234212
C  -2.255809 0.525301 -0.248013
C  -2.742224 -0.797396 -0.21049
C  -4.379277 1.233187 0.685103
C  -4.760922 -0.143226 0.660018
C  -3.133272 1.52798 0.209661
C  -0.951842 0.771685 -0.721405
C  -0.649507 -1.611077 -1.147089
C  -1.913434 -1.842731 -0.671885
C  -0.185456 -0.270598 -1.154948
C  -6.111326 -0.573722 1.163769
C  -5.316209 2.295325 1.17564
C  0.215795 -2.721959 -1.66021
C  -6.087256 -0.873908 2.662049
C  2.150197 -0.287928 -0.894728
C  3.3840 -0.219599 -1.53296
C  2.079344 -0.624968 0.451224
C  -3.038135 3.600304 -0.823297
C  4.540497 -0.511313 -0.835345
C  3.241699 -0.925416 1.145198
C  4.461092 -0.876518 0.49849
C  -2.613984 5.700691 -1.725323
C  6.064805 -2.413629 1.193627
H  -0.545075 1.773896 -0.743415
H  -2.317643 -2.846796 -0.646567
H  -6.86937 0.18021 0.943075
H  -6.39334 -1.476079 0.621549
H  -4.789406 3.202358 1.46568
H  -6.037639 2.565855 0.401965
H  -5.8784 1.962749 2.04652
H  0.605244 -2.50009 -2.654091
H  1.075147 -2.900819 -1.011485
H  -0.349188 -3.650193 -1.721239
H  -5.366476 -1.66097 2.880829
H  -5.809009 0.001213 3.251081
H  -7.065877 -1.207508 3.006992
H  3.429208 0.057976 -2.577497
H  1.129302 -0.659044 0.967342
H  5.501132 -0.451779 -1.328419
H  3.19073 -1.186412 2.193539
H  -3.657739 6.014585 -1.737928
H  -2.347512 5.32329 -2.712892
H  -1.982146 6.549235 -1.478729
totalener: -1581.00185360 hartree
nucrepener: 3021.43566356 hartree
electener: -4602.43751716 hartree
oneelecener: -8171.56239464 hartree
twoeener: 3569.12487748 hartree
kineticenergy: 1574.85118921 hartree
xcener: -144.865607397932 hartree
chargesum: -0.0000000
charge: -0.156058 -0.170786 -0.171484 -0.310139 -0.296544 -0.264853 -0.296226 -0.351399 -0.288290 -0.050214 0.094913 0.008567 0.197930 0.225561 -0.064071 0.003409 -0.182936 0.095413 -0.165360 -0.286483 -0.213307 -0.257807 0.238580 -0.194047 -0.160087 0.479305 -0.095247 -0.131587 0.163175 -0.126455 0.575515 0.133362 0.104187 0.077429 0.089190 0.099339 0.124655 0.103233 0.110050 0.100457 0.090179 0.096719 0.073162 0.087571 0.125791 0.131313 0.126044 0.128989 0.112853 0.114735 0.121756
qa: -0.1561 -0.1708 -0.1715 -0.3101 -0.2965 -0.2649 -0.2962 -0.3514 -0.2883 -0.0502 0.0949 0.0086 0.1979 0.2256 -0.0641 0.0034 -0.1829 0.0954 -0.1654 -0.2865 -0.2133 -0.2578 0.2386 -0.1940 -0.1601 0.4793 -0.0952 -0.1316 0.1632 -0.1265 0.5755 0.1334 0.1042 0.0774 0.0892 0.0993 0.1247 0.1032 0.1100 0.1005 0.0902 0.0967 0.0732 0.0876 0.1258 0.1313 0.1260 0.1290 0.1129 0.1147 0.1218
va: 1.1538 1.1308 1.1298 2.1295 2.1084 2.1262 2.1010 2.1477 3.1350 3.8237 4.0858 3.7618 3.7838 3.7454 3.9063 3.8346 4.1173 3.9253 3.8801 3.9038 3.9027 3.9134 3.7990 4.0208 3.8729 4.3623 4.0285 4.0649 3.8529 3.8874 4.6314 1.0279 1.0420 1.0010 1.0254 1.0109 0.9907 0.9993 0.9992 0.9977 1.0073 1.0073 1.0054 1.0064 1.0150 1.0104 1.0074 1.0081 0.9934 0.9931 0.9946
dispcorr: -0.024951813 hartree
energy: -1581.026805411910
dipole: -59.23745 58.37110 -0.86635 16.69606 -15.53024 1.16582 -2.61027 2.51402 -0.09626
magnitude: 1.45567 au
magnitude: 3.70001 debye
