program: Orca
programVersion: 5.0.2
elementType: F F F O O O O O N C C C C C C C C C C C C C C C C C C C C C C H H H H H H H H H H H H H H H H H H H H
charge: 0
multiplicity: 1
keywords: wb97x-d3
keywords: def2-TZVPP
keywords: def2/J RIJCOSX
keywords: DEFGRID2
keywords: scfconv7
keywords: smallprint printgap noloewdin
keywords: NOSOSCF
formula: C22H20F3NO5
InChI: InChI=1/C22H20F3NO5/c1-5-17-13(3)20(30-21(27)28-4)16-11-19(12(2)10-18(16)26-17)29-14-6-8-15(9-7-14)31-22(23,24)25/h6-11H,5H2,1-4H3
51 atoms
F  7.32248 -1.870958 1.879186
F  6.760318 -0.634464 0.204032
F  5.808557 -0.353315 2.102414
O  -2.409361 2.701201 -0.258993
O  0.823334 -0.858741 -1.754391
O  -2.155794 4.483772 -1.411602
O  5.409042 -2.226236 0.968648
O  -3.861399 3.117117 -1.939712
N  -4.127779 -0.95379 0.62505
C  -2.290642 0.3316 -0.277421
C  -2.911531 -0.892092 0.049328
C  -4.228766 1.450136 0.660012
C  -4.758681 0.150134 0.919166
C  -3.012374 1.50094 0.037693
C  -1.011946 0.321502 -0.871862
C  -1.008146 -2.118252 -0.839055
C  -2.245293 -2.098802 -0.25296
C  -0.40129 -0.870443 -1.136595
C  -6.090382 -0.019558 1.597325
C  -4.984276 2.688714 1.036085
C  -0.320652 -3.406505 -1.176391
C  -5.939783 -0.098436 3.11604
C  1.92711 -1.173514 -1.027646
C  3.070487 -1.500493 -1.748214
C  1.954293 -1.177845 0.36102
C  -2.91088 3.411531 -1.281456
C  4.238625 -1.825172 -1.084379
C  3.126622 -1.509825 1.023264
C  4.25925 -1.830969 0.300561
C  -2.531061 5.389085 -2.442859
C  6.304421 -1.278534 1.27951
H  -0.504501 1.244984 -1.117181
H  -2.75481 -3.022521 -0.009338
H  -6.776158 0.784969 1.326461
H  -6.530168 -0.947445 1.232038
H  -4.325762 3.546975 1.158129
H  -5.723976 2.94434 0.275366
H  -5.511817 2.561229 1.97944
H  0.558291 -3.575346 -0.551711
H  -0.994644 -4.248421 -1.029684
H  0.015333 -3.422445 -2.213654
H  -5.289739 -0.928461 3.390289
H  -5.505716 0.812105 3.531825
H  -6.905967 -0.253748 3.595981
H  3.036506 -1.500861 -2.829276
H  1.073281 -0.923786 0.934721
H  5.123528 -2.094265 -1.64477
H  3.147469 -1.528685 2.104211
H  -2.497219 4.915985 -3.424112
H  -1.806273 6.196918 -2.403922
H  -3.531513 5.78955 -2.279093
totalener: -1581.00189275 hartree
nucrepener: 3013.66331364 hartree
electener: -4594.66520639 hartree
oneelecener: -8156.03751282 hartree
twoeener: 3561.37230643 hartree
kineticenergy: 1574.84340112 hartree
xcener: -144.864649777269 hartree
chargesum: -0.0000000
charge: -0.156719 -0.170805 -0.170217 -0.307625 -0.296997 -0.264079 -0.296286 -0.353503 -0.290721 -0.048588 0.097508 0.018491 0.200194 0.224893 -0.091155 0.008975 -0.181764 0.100524 -0.166139 -0.292535 -0.210545 -0.256859 0.213704 -0.182308 -0.145196 0.481867 -0.097956 -0.133164 0.165112 -0.127054 0.575251 0.134787 0.103973 0.077862 0.088197 0.100631 0.128174 0.101935 0.098578 0.091159 0.108877 0.096501 0.072420 0.087778 0.126251 0.131881 0.126365 0.128604 0.115046 0.122181 0.112500
qa: -0.1567 -0.1708 -0.1702 -0.3076 -0.2970 -0.2641 -0.2963 -0.3535 -0.2907 -0.0486 0.0975 0.0185 0.2002 0.2249 -0.0912 0.0090 -0.1818 0.1005 -0.1661 -0.2925 -0.2105 -0.2569 0.2137 -0.1823 -0.1452 0.4819 -0.0980 -0.1332 0.1651 -0.1271 0.5753 0.1348 0.1040 0.0779 0.0882 0.1006 0.1282 0.1019 0.0986 0.0912 0.1089 0.0965 0.0724 0.0878 0.1263 0.1319 0.1264 0.1286 0.1150 0.1222 0.1125
va: 1.1529 1.1309 1.1318 2.1310 2.1074 2.1283 2.0999 2.1466 3.1316 3.7991 4.0777 3.7431 3.7797 3.7626 3.9176 3.8378 4.1175 3.9212 3.8849 3.8988 3.9018 3.9128 3.8272 4.0091 3.8687 4.3608 4.0375 4.0671 3.8497 3.8867 4.6332 1.0274 1.0425 1.0004 1.0250 1.0081 0.9917 1.0004 0.9975 1.0078 1.0000 1.0082 1.0055 1.0065 1.0148 1.0092 1.0075 1.0085 0.9933 0.9946 0.9931
dispcorr: -0.024898781 hartree
energy: -1581.026791531342
dipole: -61.41910 60.54095 -0.87815 8.72830 -7.87686 0.85144 -1.99708 1.76346 -0.23363
magnitude: 1.24526 au
magnitude: 3.16521 debye
