program: Orca
programVersion: 5.0.2
elementType: F F F O O O O O N C C C C C C C C C C C C C C C C C C C C C C H H H H H H H H H H H H H H H H H H H H
charge: 0
multiplicity: 1
keywords: wb97x-d3
keywords: def2-TZVPP
keywords: def2/J RIJCOSX
keywords: DEFGRID2
keywords: scfconv7
keywords: smallprint printgap noloewdin
keywords: NOSOSCF
formula: C22H20F3NO5
InChI: InChI=1/C22H20F3NO5/c1-5-17-13(3)20(30-21(27)28-4)16-11-19(12(2)10-18(16)26-17)29-14-6-8-15(9-7-14)31-22(23,24)25/h6-11H,5H2,1-4H3
51 atoms
F  5.771076 -0.219705 2.147328
F  7.31042 -1.718653 1.97121
F  6.742037 -0.530374 0.264252
O  -2.423929 2.682103 -0.280313
O  0.830054 -0.878359 -1.732306
O  -2.139095 4.470781 -1.415599
O  5.409349 -2.125369 1.056926
O  -3.753477 3.04772 -2.069318
N  -4.158359 -0.973483 0.566407
C  -2.305091 0.310962 -0.303125
C  -2.929735 -0.912356 0.017141
C  -4.267037 1.430102 0.581576
C  -4.800343 0.130501 0.835727
C  -3.033785 1.480082 -0.006601
C  -1.017412 0.301726 -0.876939
C  -1.005846 -2.137532 -0.82681
C  -2.253115 -2.118835 -0.262495
C  -0.400343 -0.889782 -1.126942
C  -6.14862 -0.037804 1.480472
C  -5.035293 2.670214 0.924679
C  -0.304873 -3.424582 -1.138752
C  -6.036987 -0.105464 3.003011
C  1.930251 -1.16474 -0.989276
C  3.086235 -1.482208 -1.693864
C  1.942529 -1.148982 0.399936
C  -2.866495 3.374164 -1.341345
C  4.252131 -1.777602 -1.013444
C  3.11351 -1.450536 1.079136
C  4.258894 -1.76256 0.372107
C  -2.458871 5.359753 -2.479213
C  6.287689 -1.156765 1.350825
H  -0.50889 1.224969 -1.120666
H  -2.762679 -3.042754 -0.020099
H  -6.82857 0.763604 1.186239
H  -6.577276 -0.969165 1.110543
H  -4.382866 3.531788 1.054056
H  -5.755693 2.91453 0.141648
H  -5.588255 2.551407 1.854595
H  -0.972094 -4.27006 -0.982456
H  0.038064 -3.454355 -2.173163
H  0.571136 -3.574706 -0.50561
H  -5.396563 -0.935175 3.300022
H  -5.611171 0.807076 3.423015
H  -7.015594 -0.254754 3.459096
H  3.063982 -1.497601 -2.775267
H  1.051415 -0.901313 0.96094
H  5.147277 -2.039222 -1.560925
H  3.123696 -1.452134 2.160786
H  -2.337703 4.882477 -3.451415
H  -1.761226 6.187373 -2.391489
H  -3.479295 5.733323 -2.395045
totalener: -1581.00198521 hartree
nucrepener: 3014.85326564 hartree
electener: -4595.85525086 hartree
oneelecener: -8158.41006595 hartree
twoeener: 3562.55481509 hartree
kineticenergy: 1574.84756879 hartree
xcener: -144.865224964700 hartree
chargesum: 0.0000000
charge: -0.170270 -0.156695 -0.170968 -0.307611 -0.296572 -0.264048 -0.296179 -0.351846 -0.290475 -0.046657 0.095631 0.019410 0.199231 0.224638 -0.085942 0.010759 -0.183246 0.098478 -0.166305 -0.292997 -0.210862 -0.256728 0.213368 -0.183346 -0.144162 0.479204 -0.097445 -0.134144 0.165016 -0.127089 0.575349 0.134351 0.103797 0.077632 0.088245 0.101297 0.127597 0.101510 0.090879 0.108937 0.098646 0.096673 0.072324 0.087865 0.126378 0.131714 0.126285 0.128805 0.114938 0.122145 0.112484
qa: -0.1703 -0.1567 -0.1710 -0.3076 -0.2966 -0.2640 -0.2962 -0.3518 -0.2905 -0.0467 0.0956 0.0194 0.1992 0.2246 -0.0859 0.0108 -0.1832 0.0985 -0.1663 -0.2930 -0.2109 -0.2567 0.2134 -0.1833 -0.1442 0.4792 -0.0974 -0.1341 0.1650 -0.1271 0.5753 0.1344 0.1038 0.0776 0.0882 0.1013 0.1276 0.1015 0.0909 0.1089 0.0986 0.0967 0.0723 0.0879 0.1264 0.1317 0.1263 0.1288 0.1149 0.1221 0.1125
va: 1.1317 1.1530 1.1307 2.1305 2.1080 2.1272 2.1001 2.1481 3.1322 3.8039 4.0803 3.7488 3.7817 3.7556 3.9143 3.8369 4.1189 3.9245 3.8853 3.8986 3.9022 3.9128 3.8266 4.0101 3.8681 4.3627 4.0362 4.0674 3.8493 3.8870 4.6332 1.0268 1.0424 1.0003 1.0249 1.0088 0.9909 1.0002 1.0077 0.9998 0.9977 1.0082 1.0054 1.0064 1.0148 1.0092 1.0075 1.0083 0.9934 0.9947 0.9929
dispcorr: -0.024900884 hartree
energy: -1581.026886095411
dipole: -61.51044 60.62060 -0.88984 7.96423 -7.12552 0.83871 -2.82573 2.59838 -0.22734
magnitude: 1.24376 au
magnitude: 3.16139 debye
