program: Orca
programVersion: 5.0.2
elementType: F F F O O O O O N C C C C C C C C C C C C C C C C C C C C C C H H H H H H H H H H H H H H H H H H H H
charge: 0
multiplicity: 1
keywords: wb97x-d3
keywords: def2-TZVPP
keywords: def2/J RIJCOSX
keywords: DEFGRID2
keywords: scfconv7
keywords: smallprint printgap noloewdin
keywords: NOSOSCF
formula: C22H20F3NO5
InChI: InChI=1/C22H20F3NO5/c1-5-17-13(3)20(30-21(27)28-4)16-11-19(12(2)10-18(16)26-17)29-14-6-8-15(9-7-14)31-22(23,24)25/h6-11H,5H2,1-4H3
51 atoms
F  6.590871 -2.186511 -0.631356
F  5.686264 -1.373608 -2.397439
F  7.481822 -0.485823 -1.603031
O  -2.898769 1.984063 1.759176
O  0.698066 -1.533953 1.471998
O  -2.157039 3.876514 2.418182
O  5.646852 -0.174363 -0.523937
O  -2.472041 3.573207 0.212336
N  -4.141154 -0.81064 -1.019104
C  -2.467621 0.003501 0.522664
C  -2.939601 -0.931782 -0.42134
C  -4.554253 1.207849 0.223586
C  -4.916722 0.195959 -0.718228
C  -3.323434 1.086235 0.807327
C  -1.212821 -0.200279 1.132039
C  -0.913941 -2.251016 -0.154125
C  -2.133202 -2.044846 -0.7428
C  -0.474771 -1.300104 0.801314
C  -6.22942 0.254421 -1.450533
C  -5.467312 2.348542 0.559133
C  -0.077081 -3.452803 -0.46954
C  -6.224415 1.285869 -2.576605
C  1.884462 -1.190782 0.909661
C  3.023521 -1.551905 1.623104
C  2.005693 -0.507102 -0.293459
C  -2.501844 3.195519 1.343982
C  4.27702 -1.231518 1.138378
C  3.267508 -0.194832 -0.780564
C  4.39338 -0.555534 -0.065789
C  -1.706561 5.207202 2.193578
C  6.331191 -1.047471 -1.276086
H  -0.840144 0.485966 1.880813
H  -2.520964 -2.748469 -1.468451
H  -6.41149 -0.736154 -1.866032
H  -7.051191 0.462814 -0.761025
H  -5.272253 3.2115 -0.079871
H  -6.513052 2.078543 0.430226
H  -5.347163 2.669906 1.593046
H  0.147965 -4.027925 0.429285
H  -0.595208 -4.109011 -1.166144
H  0.877781 -3.178814 -0.921653
H  -6.066741 2.299402 -2.208057
H  -5.433493 1.067761 -3.293591
H  -7.173571 1.274594 -3.112304
H  2.918053 -2.078678 2.562082
H  1.130348 -0.206959 -0.854133
H  5.159599 -1.496014 1.704536
H  3.365304 0.34762 -1.71121
H  -0.809913 5.227635 1.574422
H  -1.478639 5.610859 3.175612
H  -2.476349 5.815964 1.719386
totalener: -1581.00203043 hartree
nucrepener: 3024.43483405 hartree
electener: -4605.43686448 hartree
oneelecener: -8177.55531038 hartree
twoeener: 3572.11844590 hartree
kineticenergy: 1574.82874951 hartree
xcener: -144.861882552227 hartree
chargesum: 0.0000000
charge: -0.172049 -0.170320 -0.156877 -0.306236 -0.292478 -0.263568 -0.296341 -0.355584 -0.280978 -0.034887 0.103069 0.005411 0.188053 0.232208 -0.085165 0.002988 -0.177510 0.098616 -0.166769 -0.314313 -0.216441 -0.259538 0.246032 -0.208551 -0.163921 0.482951 -0.090125 -0.128815 0.159650 -0.127326 0.575177 0.132109 0.104440 0.089444 0.077182 0.123708 0.107787 0.111408 0.109198 0.089434 0.099055 0.084279 0.095853 0.084728 0.125608 0.134119 0.126172 0.129098 0.115169 0.122565 0.112281
qa: -0.1720 -0.1703 -0.1569 -0.3062 -0.2925 -0.2636 -0.2963 -0.3556 -0.2810 -0.0349 0.1031 0.0054 0.1881 0.2322 -0.0852 0.0030 -0.1775 0.0986 -0.1668 -0.3143 -0.2164 -0.2595 0.2460 -0.2086 -0.1639 0.4830 -0.0901 -0.1288 0.1596 -0.1273 0.5752 0.1321 0.1044 0.0894 0.0772 0.1237 0.1078 0.1114 0.1092 0.0894 0.0991 0.0843 0.0959 0.0847 0.1256 0.1341 0.1262 0.1291 0.1152 0.1226 0.1123
va: 1.1293 1.1315 1.1526 2.1294 2.1068 2.1284 2.1007 2.1453 3.1398 3.7907 4.0665 3.7370 3.8067 3.7561 3.9183 3.8357 4.1043 3.9230 3.8520 3.8865 3.9106 3.9175 3.7948 4.0350 3.8822 4.3602 4.0259 4.0650 3.8564 3.8865 4.6331 1.0271 1.0417 1.0300 1.0049 0.9914 1.0032 1.0053 0.9977 1.0069 0.9992 1.0027 1.0049 1.0060 1.0156 1.0096 1.0080 1.0078 0.9931 0.9945 0.9934
dispcorr: -0.024893967 hartree
energy: -1581.026924396661
dipole: -60.50943 59.46244 -1.04699 14.08068 -13.24371 0.83697 1.82749 -1.10186 0.72564
magnitude: 1.52422 au
magnitude: 3.87425 debye
