program: Orca
programVersion: 5.0.2
elementType: F F F O O O O O N C C C C C C C C C C C C C C C C C C C C C C H H H H H H H H H H H H H H H H H H H H
charge: 0
multiplicity: 1
keywords: wb97x-d3
keywords: def2-TZVPP
keywords: def2/J RIJCOSX
keywords: DEFGRID2
keywords: scfconv7
keywords: smallprint printgap noloewdin
keywords: NOSOSCF
formula: C22H20F3NO5
InChI: InChI=1/C22H20F3NO5/c1-5-17-13(3)20(30-21(27)28-4)16-11-19(12(2)10-18(16)26-17)29-14-6-8-15(9-7-14)31-22(23,24)25/h6-11H,5H2,1-4H3
51 atoms
F  6.745926 -0.511676 0.292658
F  5.785495 -0.288982 2.194485
F  7.335771 -1.764197 1.946226
O  -2.350879 2.73657 -0.174683
O  0.827708 -0.867743 -1.700944
O  -2.017859 4.462591 -1.393484
O  5.434651 -2.150145 1.024844
O  -3.609007 3.005762 -2.03014
N  -4.107858 -0.898564 0.715607
C  -2.257275 0.359999 -0.197655
C  -2.893957 -0.854459 0.12865
C  -4.184685 1.504654 0.725212
C  -4.726011 0.210312 1.005059
C  -2.96406 1.539449 0.115836
C  -0.983072 0.334908 -0.798307
C  -1.015125 -2.103842 -0.778736
C  -2.247702 -2.069258 -0.18148
C  -0.392885 -0.864651 -1.07526
C  -6.078908 0.101466 1.658285
C  -4.946465 2.748558 1.06257
C  -0.347877 -3.398809 -1.129742
C  -6.588599 -1.319901 1.817524
C  1.936267 -1.159733 -0.972867
C  3.091332 -1.444778 -1.69309
C  1.957729 -1.18246 0.415913
C  -2.750401 3.371972 -1.28727
C  4.264298 -1.748291 -1.028207
C  3.135426 -1.492955 1.078982
C  4.27872 -1.774253 0.356884
C  -2.288762 5.284673 -2.523009
C  6.304755 -1.186621 1.354889
H  -0.462251 1.251605 -1.040889
H  -2.767506 -2.98685 0.063436
H  -6.036912 0.588083 2.63921
H  -6.797682 0.691678 1.08044
H  -4.302571 3.623914 1.114018
H  -5.718186 2.947935 0.316163
H  -5.443552 2.661278 2.027565
H  -0.056221 -3.425965 -2.180153
H  0.556009 -3.565522 -0.541247
H  -1.018538 -4.2362 -0.946677
H  -7.570892 -1.31246 2.289679
H  -6.677836 -1.821302 0.855466
H  -5.919406 -1.917631 2.433248
H  3.062853 -1.428545 -2.774288
H  1.068313 -0.959732 0.989742
H  5.158847 -1.984363 -1.588186
H  3.151683 -1.527026 2.159746
H  -3.312606 5.658233 -2.509964
H  -2.121376 4.749598 -3.457603
H  -1.597247 6.11909 -2.453443
totalener: -1581.00267824 hartree
nucrepener: 3015.89383563 hartree
electener: -4596.89651387 hartree
oneelecener: -8160.57987587 hartree
twoeener: 3563.68336200 hartree
kineticenergy: 1574.85073938 hartree
xcener: -144.867408181173 hartree
chargesum: -0.0000000
charge: -0.170817 -0.170681 -0.156808 -0.308784 -0.296218 -0.264293 -0.296088 -0.351221 -0.307507 -0.040781 0.083472 0.005975 0.173301 0.241407 -0.074115 0.010210 -0.185658 0.095261 -0.128109 -0.280431 -0.211114 -0.240408 0.217954 -0.185506 -0.143935 0.477757 -0.097591 -0.135675 0.165334 -0.127129 0.575211 0.133964 0.106679 0.075703 0.080408 0.099246 0.122535 0.101541 0.109309 0.098387 0.090244 0.081846 0.083712 0.081790 0.125988 0.131295 0.126043 0.128725 0.112484 0.114935 0.122156
qa: -0.1708 -0.1707 -0.1568 -0.3088 -0.2962 -0.2643 -0.2961 -0.3512 -0.3075 -0.0408 0.0835 0.0060 0.1733 0.2414 -0.0741 0.0102 -0.1857 0.0953 -0.1281 -0.2804 -0.2111 -0.2404 0.2180 -0.1855 -0.1439 0.4778 -0.0976 -0.1357 0.1653 -0.1271 0.5752 0.1340 0.1067 0.0757 0.0804 0.0992 0.1225 0.1015 0.1093 0.0984 0.0902 0.0818 0.0837 0.0818 0.1260 0.1313 0.1260 0.1287 0.1125 0.1149 0.1222
va: 1.1309 1.1312 1.1527 2.1293 2.1090 2.1270 2.1003 2.1474 3.0966 3.8215 4.1130 3.8287 3.7859 3.7283 3.9150 3.8318 4.0925 3.9264 3.8791 3.9030 3.9040 3.9595 3.8186 4.0150 3.8679 4.3631 4.0378 4.0706 3.8484 3.8875 4.6337 1.0262 1.0372 1.0022 0.9984 1.0114 0.9921 1.0015 0.9992 0.9984 1.0076 1.0041 1.0115 1.0125 1.0149 1.0099 1.0076 1.0085 0.9931 0.9934 0.9946
dispcorr: -0.024659296 hartree
energy: -1581.027337532064
dipole: -62.68765 61.79175 -0.89590 5.59340 -4.75191 0.84149 -5.63172 5.34604 -0.28568
magnitude: 1.26189 au
magnitude: 3.20746 debye
