program: Orca
programVersion: 5.0.2
elementType: F F F O O O O O N C C C C C C C C C C C C C C C C C C C C C C H H H H H H H H H H H H H H H H H H H H
charge: 0
multiplicity: 1
keywords: wb97x-d3
keywords: def2-TZVPP
keywords: def2/J RIJCOSX
keywords: DEFGRID2
keywords: scfconv7
keywords: smallprint printgap noloewdin
keywords: NOSOSCF
formula: C22H20F3NO5
InChI: InChI=1/C22H20F3NO5/c1-5-17-13(3)20(30-21(27)28-4)16-11-19(12(2)10-18(16)26-17)29-14-6-8-15(9-7-14)31-22(23,24)25/h6-11H,5H2,1-4H3
51 atoms
F  5.377222 -2.234777 2.249379
F  6.293223 -2.830355 0.407551
F  7.351494 -1.523868 1.751669
O  -2.95472 2.392697 -1.325016
O  0.784542 -0.930896 -1.830211
O  -2.14592 4.361391 -1.512073
O  5.684653 -0.703727 0.667892
O  -2.452304 3.534289 0.557342
N  -4.085898 -1.022155 0.707044
C  -2.448625 0.19282 -0.590375
C  -2.882996 -0.955224 0.103261
C  -4.569826 1.221379 -0.014759
C  -4.895169 0.001587 0.655422
C  -3.342235 1.280696 -0.613271
C  -1.185307 0.189315 -1.214699
C  -0.807192 -2.096613 -0.450896
C  -2.035019 -2.082113 0.155653
C  -0.40137 -0.925651 -1.142809
C  -6.204085 -0.159096 1.378723
C  -5.510756 2.386646 -0.05942
C  0.067777 -3.312674 -0.418159
C  -6.225455 0.577008 2.71709
C  1.957887 -0.864651 -1.151494
C  2.058239 -0.489581 0.18233
C  3.102213 -1.180925 -1.875505
C  -2.507344 3.449587 -0.631841
C  3.303965 -0.455658 0.792774
C  4.341462 -1.138929 -1.265929
C  4.435019 -0.784515 0.069846
C  -1.629304 5.574628 -0.978636
C  6.159909 -1.809874 1.256632
H  -0.83766 1.04712 -1.774604
H  -2.39758 -2.95366 0.685863
H  -7.036213 0.17834 0.755765
H  -6.351009 -1.225313 1.547551
H  -6.549245 2.071685 0.015871
H  -5.317639 3.078268 0.76278
H  -5.412257 2.946183 -0.988802
H  0.393133 -3.600525 -1.418173
H  0.967778 -3.15175 0.17792
H  -0.466736 -4.155778 0.015629
H  -7.172815 0.414503 3.231043
H  -5.426937 0.217923 3.365743
H  -6.096251 1.652848 2.599089
H  1.17778 -0.222044 0.751718
H  3.012777 -1.461198 -2.916434
H  3.386532 -0.157825 1.829316
H  5.232563 -1.375931 -1.830972
H  -1.379764 6.191402 -1.836993
H  -0.733576 5.400841 -0.382624
H  -2.36788 6.088387 -0.36334
totalener: -1581.00176014 hartree
nucrepener: 3029.39842368 hartree
electener: -4610.40018382 hartree
oneelecener: -8187.47609281 hartree
twoeener: 3577.07590899 hartree
kineticenergy: 1574.84373693 hartree
xcener: -144.864616259838 hartree
chargesum: -0.0000000
charge: -0.170610 -0.171434 -0.156649 -0.307518 -0.295181 -0.263982 -0.296182 -0.355487 -0.280571 -0.035349 0.101146 0.002856 0.186487 0.233428 -0.089459 0.010887 -0.179588 0.094408 -0.164092 -0.313074 -0.210732 -0.261387 0.236592 -0.172964 -0.198436 0.482295 -0.120746 -0.091964 0.159710 -0.126375 0.575825 0.132923 0.104453 0.076547 0.089269 0.106922 0.122249 0.111623 0.108974 0.101085 0.090642 0.084963 0.096498 0.084592 0.136033 0.126090 0.129489 0.126697 0.122100 0.114298 0.112701
qa: -0.1706 -0.1714 -0.1566 -0.3075 -0.2952 -0.2640 -0.2962 -0.3555 -0.2806 -0.0353 0.1011 0.0029 0.1865 0.2334 -0.0895 0.0109 -0.1796 0.0944 -0.1641 -0.3131 -0.2107 -0.2614 0.2366 -0.1730 -0.1984 0.4823 -0.1207 -0.0920 0.1597 -0.1264 0.5758 0.1329 0.1045 0.0765 0.0893 0.1069 0.1222 0.1116 0.1090 0.1011 0.0906 0.0850 0.0965 0.0846 0.1360 0.1261 0.1295 0.1267 0.1221 0.1143 0.1127
va: 1.1309 1.1302 1.1530 2.1285 2.1055 2.1276 2.1013 2.1450 3.1404 3.8083 4.0736 3.7408 3.8096 3.7424 3.9156 3.8414 4.1048 3.9240 3.8513 3.8894 3.8986 3.9173 3.8077 3.8832 4.0182 4.3597 4.0536 4.0237 3.8565 3.8869 4.6318 1.0286 1.0420 1.0047 1.0301 1.0031 0.9910 1.0054 0.9993 0.9971 1.0075 1.0060 1.0049 1.0024 1.0085 1.0154 1.0079 1.0073 0.9947 0.9934 0.9931
dispcorr: -0.025081147 hartree
energy: -1581.026841283755
dipole: -58.80859 57.86458 -0.94401 16.77411 -15.74535 1.02876 -0.37556 -0.15777 -0.53333
magnitude: 1.49464 au
magnitude: 3.79906 debye
