program: Orca
programVersion: 5.0.2
elementType: F F F O O O O O N C C C C C C C C C C C C C C C C C C C C C C H H H H H H H H H H H H H H H H H H H H
charge: 0
multiplicity: 1
keywords: wb97x-d3
keywords: def2-TZVPP
keywords: def2/J RIJCOSX
keywords: DEFGRID2
keywords: scfconv7
keywords: smallprint printgap noloewdin
keywords: NOSOSCF
formula: C22H20F3NO5
InChI: InChI=1/C22H20F3NO5/c1-5-17-13(3)20(30-21(27)28-4)16-11-19(12(2)10-18(16)26-17)29-14-6-8-15(9-7-14)31-22(23,24)25/h6-11H,5H2,1-4H3
51 atoms
F  5.053573 -1.710313 2.434181
F  6.252409 -2.280845 0.752611
F  6.953923 -0.752607 2.099246
O  -2.880648 2.243534 -1.464003
O  0.653762 -1.324822 -1.925318
O  -1.788098 4.061126 -1.738907
O  5.335311 -0.255082 0.773159
O  -2.023838 3.271474 0.354292
N  -4.143206 -1.020594 0.733221
C  -2.510289 0.020961 -0.711012
C  -2.984238 -1.069408 0.047321
C  -4.48971 1.239979 -0.016678
C  -4.863111 0.069028 0.713561
C  -3.312642 1.177837 -0.707709
C  -1.278931 -0.08667 -1.387465
C  -1.005791 -2.355884 -0.536106
C  -2.212283 -2.249835 0.103262
C  -0.554678 -1.237746 -1.281445
C  -6.10601 0.047716 1.560308
C  -5.318678 2.488606 -0.013284
C  -0.1795 -3.60355 -0.466537
C  -5.905711 0.77331 2.889975
C  1.775604 -1.044882 -1.210516
C  1.753656 -0.514038 0.073843
C  2.990461 -1.306923 -1.835316
C  -2.20551 3.210432 -0.823754
C  2.946644 -0.266289 0.734661
C  4.177787 -1.054237 -1.173418
C  4.148675 -0.541579 0.113456
C  -1.024693 5.164722 -1.266395
C  5.881931 -1.239653 1.500703
H  -0.895264 0.730126 -1.984455
H  -2.603706 -3.075329 0.684098
H  -6.954299 0.48076 1.025292
H  -6.35207 -0.996498 1.749802
H  -6.373637 2.275353 0.143607
H  -5.001246 3.166591 0.781531
H  -5.23579 3.027557 -0.955713
H  -0.70981 -4.385194 0.074018
H  0.057343 -3.98314 -1.460778
H  0.768919 -3.433097 0.046342
H  -6.803235 0.707411 3.50482
H  -5.083226 0.327981 3.449151
H  -5.677492 1.830342 2.751953
H  0.820052 -0.287841 0.570155
H  2.998292 -1.709926 -2.839159
H  2.931506 0.151895 1.731932
H  5.122406 -1.249622 -1.662488
H  -0.109574 4.835448 -0.774582
H  -1.596354 5.780983 -0.572777
H  -0.773154 5.747541 -2.147526
totalener: -1581.00148301 hartree
nucrepener: 3058.68231013 hartree
electener: -4639.68379315 hartree
oneelecener: -8246.04397650 hartree
twoeener: 3606.36018335 hartree
kineticenergy: 1574.85242991 hartree
xcener: -144.865551240091 hartree
chargesum: -0.0000000
charge: -0.169799 -0.171822 -0.156444 -0.309330 -0.298046 -0.263409 -0.296839 -0.354681 -0.282120 -0.027419 0.105233 -0.005635 0.187054 0.236553 -0.091737 0.006215 -0.185487 0.106286 -0.163733 -0.309792 -0.211086 -0.259912 0.218688 -0.132858 -0.187630 0.479986 -0.150924 -0.101629 0.170250 -0.126143 0.575390 0.132064 0.105321 0.077157 0.089261 0.106170 0.120807 0.112605 0.088987 0.108305 0.098378 0.085381 0.096590 0.083182 0.135653 0.125358 0.129357 0.126477 0.115023 0.112505 0.122237
qa: -0.1698 -0.1718 -0.1564 -0.3093 -0.2980 -0.2634 -0.2968 -0.3547 -0.2821 -0.0274 0.1052 -0.0056 0.1871 0.2366 -0.0917 0.0062 -0.1855 0.1063 -0.1637 -0.3098 -0.2111 -0.2599 0.2187 -0.1329 -0.1876 0.4800 -0.1509 -0.1016 0.1703 -0.1261 0.5754 0.1321 0.1053 0.0772 0.0893 0.1062 0.1208 0.1126 0.0890 0.1083 0.0984 0.0854 0.0966 0.0832 0.1357 0.1254 0.1294 0.1265 0.1150 0.1125 0.1222
va: 1.1313 1.1299 1.1534 2.1268 2.1081 2.1280 2.1005 2.1442 3.1393 3.7964 4.0684 3.7536 3.8085 3.7411 3.8962 3.8453 4.1145 3.9209 3.8524 3.8924 3.9140 3.9171 3.8111 3.8627 4.0242 4.3603 4.0801 4.0395 3.8393 3.8865 4.6321 1.0270 1.0414 1.0052 1.0296 1.0032 0.9907 1.0058 1.0065 0.9987 0.9995 1.0059 1.0054 1.0026 1.0098 1.0148 1.0083 1.0078 0.9931 0.9936 0.9947
dispcorr: -0.025301388 hartree
energy: -1581.026784400437
dipole: -55.57269 54.70442 -0.86826 13.65121 -12.70804 0.94317 -1.33120 0.77025 -0.56095
magnitude: 1.39932 au
magnitude: 3.55680 debye
