program: Orca
programVersion: 5.0.2
elementType: F F F O O O O O N C C C C C C C C C C C C C C C C C C C C C C H H H H H H H H H H H H H H H H H H H H
charge: 0
multiplicity: 1
keywords: wb97x-d3
keywords: def2-TZVPP
keywords: def2/J RIJCOSX
keywords: DEFGRID2
keywords: scfconv7
keywords: smallprint printgap noloewdin
keywords: NOSOSCF
formula: C22H20F3NO5
InChI: InChI=1/C22H20F3NO5/c1-5-17-13(3)20(30-21(27)28-4)16-11-19(12(2)10-18(16)26-17)29-14-6-8-15(9-7-14)31-22(23,24)25/h6-11H,5H2,1-4H3
51 atoms
F  7.110209 -0.838158 -2.146815
F  6.385263 -2.390545 -0.842343
F  5.186482 -1.746295 -2.49615
O  -2.915967 2.112353 1.835926
O  0.680345 -1.404059 1.630231
O  -2.127698 3.95469 2.572655
O  5.50898 -0.345645 -0.796986
O  -2.346369 3.712167 0.346387
N  -4.040051 -0.609977 -1.063295
C  -2.460612 0.134245 0.606207
C  -2.893234 -0.780152 -0.374919
C  -4.478343 1.406677 0.171578
C  -4.795282 0.421473 -0.815881
C  -3.303304 1.239739 0.846317
C  -1.23994 -0.091786 1.271854
C  -0.9125 -2.14164 -0.009385
C  -2.099129 -1.911918 -0.654015
C  -0.497692 -1.193935 0.9597
C  -6.056697 0.562863 -1.626523
C  -5.390223 2.567082 0.426231
C  -0.080114 -3.352763 -0.301205
C  -6.225214 -0.487944 -2.709739
C  1.842725 -1.102182 0.995138
C  1.900035 -0.421453 -0.215339
C  3.015936 -1.506246 1.623211
C  -2.447586 3.313312 1.466573
C  3.12876 -0.183601 -0.81033
C  4.240321 -1.256445 1.031311
C  4.288155 -0.609604 -0.192737
C  -1.610388 5.269342 2.407054
C  6.031067 -1.319509 -1.556794
H  -0.883968 0.591091 2.031661
H  -2.462484 -2.603705 -1.403401
H  -6.917759 0.532697 -0.949626
H  -6.079996 1.563186 -2.070972
H  -5.218714 3.366678 -0.297022
H  -6.436094 2.275143 0.347941
H  -5.252809 2.985826 1.421364
H  0.870546 -3.090744 -0.769128
H  0.152654 -3.907388 0.608104
H  -0.605335 -4.023643 -0.978301
H  -6.255187 -1.491824 -2.290947
H  -7.154064 -0.316837 -3.253694
H  -5.403533 -0.459539 -3.423277
H  0.999673 -0.078228 -0.706444
H  2.962531 -2.020653 2.573296
H  3.177774 0.342328 -1.754235
H  5.152174 -1.564289 1.524412
H  -1.416259 5.637558 3.410107
H  -2.328362 5.923066 1.912078
H  -0.683023 5.265911 1.834652
totalener: -1581.00249598 hartree
nucrepener: 3035.63762959 hartree
electener: -4616.64012557 hartree
oneelecener: -8200.05077191 hartree
twoeener: 3583.41064634 hartree
kineticenergy: 1574.85943368 hartree
xcener: -144.869397870969 hartree
chargesum: -0.0000000
charge: -0.156240 -0.172914 -0.168986 -0.305839 -0.297060 -0.263569 -0.296448 -0.353585 -0.308426 -0.026314 0.084521 0.006770 0.179690 0.235666 -0.092778 -0.000408 -0.180932 0.108972 -0.129890 -0.285550 -0.213456 -0.240063 0.234245 -0.150872 -0.194085 0.477933 -0.139372 -0.096713 0.163317 -0.127237 0.575580 0.130713 0.106914 0.074946 0.081147 0.125684 0.102641 0.099446 0.100240 0.109675 0.089686 0.082026 0.081789 0.083262 0.134105 0.125723 0.129114 0.127052 0.122469 0.112377 0.115035
qa: -0.1562 -0.1729 -0.1690 -0.3058 -0.2971 -0.2636 -0.2964 -0.3536 -0.3084 -0.0263 0.0845 0.0068 0.1797 0.2357 -0.0928 -0.0004 -0.1809 0.1090 -0.1299 -0.2856 -0.2135 -0.2401 0.2342 -0.1509 -0.1941 0.4779 -0.1394 -0.0967 0.1633 -0.1272 0.5756 0.1307 0.1069 0.0749 0.0811 0.1257 0.1026 0.0994 0.1002 0.1097 0.0897 0.0820 0.0818 0.0833 0.1341 0.1257 0.1291 0.1271 0.1225 0.1124 0.1150
va: 1.1538 1.1287 1.1318 2.1315 2.1081 2.1272 2.1004 2.1468 3.0928 3.7815 4.1106 3.8186 3.7720 3.7603 3.9284 3.8350 4.0844 3.9108 3.8814 3.8993 3.9069 3.9586 3.7996 3.8643 4.0259 4.3649 4.0680 4.0334 3.8490 3.8865 4.6310 1.0279 1.0369 1.0026 0.9982 0.9930 1.0022 1.0089 0.9989 0.9986 1.0071 1.0128 1.0042 1.0115 1.0098 1.0149 1.0073 1.0082 0.9945 0.9934 0.9931
dispcorr: -0.024785587 hartree
energy: -1581.027281567241
dipole: -58.21273 57.21794 -0.99479 12.47047 -11.59758 0.87290 3.11767 -2.34191 0.77576
magnitude: 1.53407 au
magnitude: 3.89929 debye
