program: Orca
programVersion: 5.0.2
elementType: F F F O O O O O N C C C C C C C C C C C C C C C C C C C C C C H H H H H H H H H H H H H H H H H H H H
charge: 0
multiplicity: 1
keywords: wb97x-d3
keywords: def2-TZVPP
keywords: def2/J RIJCOSX
keywords: DEFGRID2
keywords: scfconv7
keywords: smallprint printgap noloewdin
keywords: NOSOSCF
formula: C22H20F3NO5
InChI: InChI=1/C22H20F3NO5/c1-5-17-13(3)20(30-21(27)28-4)16-11-19(12(2)10-18(16)26-17)29-14-6-8-15(9-7-14)31-22(23,24)25/h6-11H,5H2,1-4H3
51 atoms
F  5.899915 -1.252943 1.849827
F  6.735648 -1.301983 -0.121185
F  7.195911 0.345431 1.195918
O  -1.771803 2.107328 0.064062
O  0.545554 -2.284237 -1.051599
O  -0.760124 3.768319 -0.81879
O  5.217748 0.258493 0.360896
O  -2.599578 2.981363 -1.846819
N  -4.594799 -0.903212 0.285841
C  -2.322187 -0.189072 -0.124306
C  -3.312348 -1.18665 -0.012803
C  -4.03582 1.430948 0.449786
C  -4.949296 0.335462 0.498794
C  -2.742815 1.133856 0.116851
C  -1.002011 -0.545819 -0.466743
C  -1.666826 -2.890513 -0.560234
C  -2.946462 -2.531732 -0.236771
C  -0.695637 -1.86188 -0.675368
C  -6.39978 0.553471 0.836523
C  -4.4843 2.833884 0.729522
C  -1.279513 -4.318004 -0.797294
C  -6.659831 0.452937 2.338748
C  1.666122 -1.609681 -0.673426
C  2.645906 -1.407375 -1.63491
C  1.870458 -1.189903 0.636619
C  -1.792732 2.962138 -0.967899
C  3.845332 -0.806577 -1.285313
C  3.063459 -0.580111 0.981928
C  4.044539 -0.39902 0.020757
C  -0.609046 4.775863 -1.81158
C  6.241555 -0.487141 0.814483
H  -0.241589 0.217845 -0.562219
H  -3.720195 -3.282858 -0.13937
H  -6.749069 1.515676 0.457527
H  -6.975154 -0.216098 0.321653
H  -3.664861 3.464356 1.070906
H  -4.906721 3.295583 -0.164913
H  -5.246131 2.861839 1.506176
H  -0.943021 -4.477488 -1.822592
H  -0.464273 -4.629955 -0.143432
H  -2.125577 -4.979086 -0.617377
H  -7.7203 0.57712 2.558617
H  -6.349902 -0.521973 2.713447
H  -6.113882 1.211948 2.901147
H  2.471264 -1.729278 -2.652963
H  1.104799 -1.337564 1.387315
H  4.610883 -0.64131 -2.03191
H  3.224923 -0.241473 1.996368
H  -1.462078 5.454465 -1.825484
H  -0.485749 4.345113 -2.805043
H  0.287354 5.325615 -1.540154
totalener: -1581.00192943 hartree
nucrepener: 3043.44984068 hartree
electener: -4624.45177011 hartree
oneelecener: -8215.65693729 hartree
twoeener: 3591.20516718 hartree
kineticenergy: 1574.81011434 hartree
xcener: -144.858885385823 hartree
chargesum: 0.0000000
charge: -0.167513 -0.170208 -0.155912 -0.306769 -0.309479 -0.264691 -0.296912 -0.353365 -0.291648 -0.024508 0.053254 0.005166 0.210429 0.228248 -0.146484 -0.054403 -0.142461 0.215685 -0.166545 -0.298118 -0.221164 -0.256825 0.275053 -0.217422 -0.185841 0.478201 -0.089483 -0.097287 0.155421 -0.127128 0.575066 0.143575 0.101848 0.076364 0.087654 0.099468 0.128656 0.101602 0.099379 0.093950 0.086660 0.086695 0.095900 0.072118 0.129287 0.138045 0.128636 0.129144 0.112127 0.114028 0.122503
qa: -0.1675 -0.1702 -0.1559 -0.3068 -0.3095 -0.2647 -0.2969 -0.3534 -0.2916 -0.0245 0.0533 0.0052 0.2104 0.2282 -0.1465 -0.0544 -0.1425 0.2157 -0.1665 -0.2981 -0.2212 -0.2568 0.2751 -0.2174 -0.1858 0.4782 -0.0895 -0.0973 0.1554 -0.1271 0.5751 0.1436 0.1018 0.0764 0.0877 0.0995 0.1287 0.1016 0.0994 0.0939 0.0867 0.0867 0.0959 0.0721 0.1293 0.1380 0.1286 0.1291 0.1121 0.1140 0.1225
va: 1.1342 1.1329 1.1539 2.1324 2.1075 2.1251 2.0980 2.1463 3.1382 3.8444 4.1201 3.7596 3.7592 3.7813 3.8166 3.8499 4.0782 3.8700 3.8851 3.8991 3.9370 3.9131 3.7877 4.0575 3.9794 4.3651 4.0151 4.0170 3.8670 3.8880 4.6304 1.0170 1.0402 1.0003 1.0249 1.0077 0.9915 1.0003 0.9976 1.0017 1.0053 1.0065 1.0082 1.0054 1.0130 1.0022 1.0072 1.0076 0.9930 0.9936 0.9947
dispcorr: -0.024326222 hartree
energy: -1581.026255655680
dipole: -61.71951 61.37893 -0.34058 8.17202 -7.41263 0.75938 -1.65589 1.57730 -0.07859
magnitude: 0.83597 au
magnitude: 2.12486 debye
