program: Orca
programVersion: 5.0.2
elementType: F F F O O O O O N C C C C C C C C C C C C C C C C C C C C C C H H H H H H H H H H H H H H H H H H H H
charge: 0
multiplicity: 1
keywords: wb97x-d3
keywords: def2-TZVPP
keywords: def2/J RIJCOSX
keywords: DEFGRID2
keywords: scfconv7
keywords: smallprint printgap noloewdin
keywords: NOSOSCF
formula: C22H20F3NO5
InChI: InChI=1/C22H20F3NO5/c1-5-17-13(3)20(30-21(27)28-4)16-11-19(12(2)10-18(16)26-17)29-14-6-8-15(9-7-14)31-22(23,24)25/h6-11H,5H2,1-4H3
51 atoms
F  5.903042 -1.265588 2.049864
F  6.703667 -1.38045 0.066429
F  7.196809 0.299041 1.322419
O  -1.794178 2.160044 0.047651
O  0.494128 -2.336022 -0.749363
O  -0.698149 3.595395 -1.094536
O  5.205192 0.200658 0.528447
O  -2.42041 2.542642 -2.088462
N  -4.60708 -0.820769 0.58734
C  -2.344937 -0.153866 0.058512
C  -3.336979 -1.133511 0.266917
C  -4.038754 1.516213 0.540874
C  -4.951784 0.431564 0.716692
C  -2.755739 1.186569 0.203185
C  -1.033154 -0.546261 -0.276105
C  -1.716801 -2.88599 -0.192101
C  -2.986728 -2.4939 0.130588
C  -0.739431 -1.87699 -0.391622
C  -6.408047 0.68155 0.997743
C  -4.478306 2.938953 0.71103
C  -1.344868 -4.329732 -0.336322
C  -7.204007 0.846686 -0.296642
C  1.626523 -1.665331 -0.405168
C  1.828246 -1.151245 0.870763
C  2.62164 -1.564192 -1.36598
C  -1.709049 2.750853 -1.153569
C  3.031998 -0.543698 1.18093
C  3.829623 -0.963005 -1.051655
C  4.025103 -0.456952 0.220391
C  -0.421568 4.323561 -2.284339
C  6.229903 -0.534509 0.984092
H  -0.265444 0.199914 -0.43283
H  -3.764592 -3.228694 0.294958
H  -6.791706 -0.176599 1.549538
H  -6.54841 1.558493 1.631934
H  -5.058623 3.065696 1.624495
H  -3.638418 3.626877 0.772804
H  -5.108391 3.260221 -0.120329
H  -0.989796 -4.554946 -1.342699
H  -0.547345 -4.611662 0.352359
H  -2.203265 -4.967738 -0.134159
H  -8.262757 0.996654 -0.085023
H  -6.858917 1.699853 -0.881946
H  -7.106957 -0.042339 -0.918864
H  1.054343 -1.224605 1.62321
H  2.450138 -1.963947 -2.356283
H  3.194065 -0.134417 2.168802
H  4.604133 -0.873774 -1.801049
H  -1.265247 4.948165 -2.578048
H  -0.170413 3.659352 -3.111192
H  0.432673 4.952973 -2.052808
totalener: -1581.00132749 hartree
nucrepener: 3050.68808061 hartree
electener: -4631.68940811 hartree
oneelecener: -8230.11049215 hartree
twoeener: 3598.42108404 hartree
kineticenergy: 1574.84415953 hartree
xcener: -144.864562320523 hartree
chargesum: 0.0000000
charge: -0.168339 -0.171293 -0.155713 -0.308450 -0.309547 -0.265203 -0.295915 -0.349314 -0.289542 -0.023975 0.056966 -0.017057 0.184250 0.243052 -0.128816 -0.054281 -0.141846 0.208986 -0.152514 -0.276768 -0.221464 -0.257430 0.280404 -0.188464 -0.224644 0.472778 -0.096799 -0.083250 0.151261 -0.127980 0.575103 0.144615 0.102158 0.088055 0.069869 0.104593 0.097559 0.114930 0.099728 0.094251 0.086571 0.084932 0.076543 0.096835 0.138225 0.129711 0.129585 0.128560 0.113126 0.113957 0.122001
qa: -0.1683 -0.1713 -0.1557 -0.3085 -0.3095 -0.2652 -0.2959 -0.3493 -0.2895 -0.0240 0.0570 -0.0171 0.1843 0.2431 -0.1288 -0.0543 -0.1418 0.2090 -0.1525 -0.2768 -0.2215 -0.2574 0.2804 -0.1885 -0.2246 0.4728 -0.0968 -0.0832 0.1513 -0.1280 0.5751 0.1446 0.1022 0.0881 0.0699 0.1046 0.0976 0.1149 0.0997 0.0943 0.0866 0.0849 0.0765 0.0968 0.1382 0.1297 0.1296 0.1286 0.1131 0.1140 0.1220
va: 1.1333 1.1312 1.1542 2.1288 2.1088 2.1230 2.1000 2.1479 3.1392 3.8788 4.1119 3.7864 3.8126 3.7370 3.8137 3.8513 4.0773 3.8770 3.8762 3.9053 3.9365 3.9161 3.7837 3.9742 4.0613 4.3665 4.0176 4.0084 3.8706 3.8898 4.6331 1.0129 1.0405 1.0253 1.0087 1.0010 1.0147 0.9916 0.9980 1.0012 1.0054 1.0055 1.0050 1.0079 1.0022 1.0133 1.0071 1.0078 0.9930 0.9932 0.9946
dispcorr: -0.024486157 hartree
energy: -1581.025813651781
dipole: -62.66130 62.29599 -0.36531 8.76122 -8.02214 0.73907 -8.80197 8.58343 -0.21854
magnitude: 0.85290 au
magnitude: 2.16790 debye
