program: Orca
programVersion: 5.0.2
elementType: F F F O O O O O N C C C C C C C C C C C C C C C C C C C C C C H H H H H H H H H H H H H H H H H H H H
charge: 0
multiplicity: 1
keywords: wb97x-d3
keywords: def2-TZVPP
keywords: def2/J RIJCOSX
keywords: DEFGRID2
keywords: scfconv7
keywords: smallprint printgap noloewdin
keywords: NOSOSCF
formula: C22H20F3NO5
InChI: InChI=1/C22H20F3NO5/c1-5-17-13(3)20(30-21(27)28-4)16-11-19(12(2)10-18(16)26-17)29-14-6-8-15(9-7-14)31-22(23,24)25/h6-11H,5H2,1-4H3
51 atoms
F  5.456887 -1.570266 -2.547714
F  7.323293 -0.704946 -1.905329
F  6.488503 -2.389606 -0.857713
O  -2.775751 2.005693 1.886181
O  0.664172 -1.643165 1.426053
O  -1.854956 3.79491 2.60654
O  5.586718 -0.36151 -0.684363
O  -2.223527 3.609393 0.395267
N  -4.134825 -0.589983 -1.029842
C  -2.444778 0.057051 0.570951
C  -2.951169 -0.806922 -0.420788
C  -4.453419 1.388762 0.30026
C  -4.854791 0.44238 -0.695234
C  -3.244466 1.172645 0.896594
C  -1.204109 -0.231511 1.172617
C  -0.989707 -2.228472 -0.21061
C  -2.197344 -1.940538 -0.790196
C  -0.511227 -1.342828 0.786384
C  -6.167948 0.629961 -1.408903
C  -5.316615 2.564078 0.642786
C  -0.202577 -3.445997 -0.587799
C  -6.452661 -0.403691 -2.484303
C  1.844263 -1.302909 0.848319
C  1.948115 -0.573436 -0.329708
C  2.993352 -1.71949 1.513026
C  -2.27411 3.192261 1.511924
C  3.202089 -0.280622 -0.845954
C  4.24024 -1.417942 0.999218
C  4.33829 -0.704989 -0.184728
C  -1.276949 5.082795 2.427305
C  6.19515 -1.247931 -1.484906
H  -0.801478 0.402528 1.951253
H  -2.612279 -2.588974 -1.551386
H  -6.975811 0.619407 -0.668927
H  -6.193783 1.635562 -1.841648
H  -5.09476 2.962089 1.631011
H  -5.181132 3.372241 -0.078653
H  -6.372179 2.297448 0.638569
H  -0.749155 -4.046982 -1.311905
H  0.760019 -3.18809 -1.032614
H  0.003541 -4.07225 0.280708
H  -5.688625 -0.393536 -3.259456
H  -6.482278 -1.410282 -2.071744
H  -7.415454 -0.198672 -2.95212
H  1.065789 -0.226728 -0.8509
H  2.902023 -2.277972 2.434894
H  3.287032 0.29224 -1.759558
H  5.131883 -1.729515 1.525804
H  -0.394784 5.04069 1.788831
H  -0.990709 5.417738 3.419824
H  -1.990325 5.785758 1.997414
totalener: -1581.00306648 hartree
nucrepener: 3028.82998024 hartree
electener: -4609.83304672 hartree
oneelecener: -8186.43739752 hartree
twoeener: 3576.60435080 hartree
kineticenergy: 1574.84017243 hartree
xcener: -144.865554761748 hartree
chargesum: -0.0000000
charge: -0.169772 -0.156490 -0.172708 -0.306697 -0.294230 -0.264033 -0.296511 -0.353415 -0.306419 -0.029159 0.085302 0.006092 0.177934 0.236607 -0.084277 0.001336 -0.181844 0.101764 -0.128583 -0.284681 -0.215402 -0.240561 0.245182 -0.158827 -0.204930 0.478804 -0.134080 -0.093650 0.161202 -0.126665 0.575442 0.132597 0.107633 0.075361 0.080688 0.099733 0.125161 0.101985 0.089034 0.099536 0.108839 0.083420 0.081847 0.082451 0.134190 0.125663 0.129027 0.126549 0.115017 0.121987 0.112551
qa: -0.1698 -0.1565 -0.1727 -0.3067 -0.2942 -0.2640 -0.2965 -0.3534 -0.3064 -0.0292 0.0853 0.0061 0.1779 0.2366 -0.0843 0.0013 -0.1818 0.1018 -0.1286 -0.2847 -0.2154 -0.2406 0.2452 -0.1588 -0.2049 0.4788 -0.1341 -0.0937 0.1612 -0.1267 0.5754 0.1326 0.1076 0.0754 0.0807 0.0997 0.1252 0.1020 0.0890 0.0995 0.1088 0.0834 0.0818 0.0825 0.1342 0.1257 0.1290 0.1265 0.1150 0.1220 0.1126
va: 1.1316 1.1532 1.1289 2.1298 2.1076 2.1275 2.1006 2.1466 3.0938 3.7938 4.1120 3.8207 3.7754 3.7536 3.9228 3.8349 4.0824 3.9175 3.8794 3.9003 3.9120 3.9593 3.7934 3.8764 4.0345 4.3635 4.0667 4.0305 3.8536 3.8866 4.6323 1.0270 1.0368 1.0026 0.9985 1.0095 0.9928 1.0025 1.0068 0.9992 0.9979 1.0118 1.0124 1.0039 1.0097 1.0153 1.0076 1.0081 0.9932 0.9947 0.9932
dispcorr: -0.024616233 hartree
energy: -1581.027682710062
dipole: -59.58862 58.61217 -0.97645 11.94420 -11.11788 0.82633 3.40198 -2.61944 0.78254
magnitude: 1.49955 au
magnitude: 3.81154 debye
