program: Orca
programVersion: 5.0.2
elementType: F F F O O O O O N C C C C C C C C C C C C C C C C C C C C C C H H H H H H H H H H H H H H H H H H H H
charge: 0
multiplicity: 1
keywords: wb97x-d3
keywords: def2-TZVPP
keywords: def2/J RIJCOSX
keywords: DEFGRID2
keywords: scfconv7
keywords: smallprint printgap noloewdin
keywords: NOSOSCF
formula: C22H20F3NO5
InChI: InChI=1/C22H20F3NO5/c1-5-17-13(3)20(30-21(27)28-4)16-11-19(12(2)10-18(16)26-17)29-14-6-8-15(9-7-14)31-22(23,24)25/h6-11H,5H2,1-4H3
51 atoms
F  5.29571 -1.027971 -2.696568
F  7.226033 -0.556237 -1.865232
F  6.159781 -2.311056 -1.21323
O  -2.913575 2.105181 1.811583
O  0.598295 -1.535895 1.552483
O  -1.703021 3.729955 2.491489
O  5.502387 -0.27096 -0.613352
O  -1.684853 3.238225 0.294665
N  -4.183628 -0.64833 -1.000832
C  -2.526521 0.084779 0.598399
C  -3.005718 -0.823655 -0.36616
C  -4.531631 1.393729 0.221412
C  -4.915513 0.392388 -0.726641
C  -3.337592 1.211095 0.855302
C  -1.295839 -0.168656 1.23482
C  -1.026887 -2.205831 -0.077132
C  -2.231961 -1.960106 -0.680609
C  -0.577513 -1.278898 0.895091
C  -6.223922 0.534419 -1.457788
C  -5.408265 2.582115 0.471723
C  -0.212357 -3.420111 -0.402357
C  -6.502486 -0.564779 -2.467579
C  1.772923 -1.204123 0.955268
C  2.927398 -1.702089 1.550649
C  1.864122 -0.401214 -0.175121
C  -2.05273 3.05464 1.414928
C  4.166319 -1.405494 1.014811
C  3.110387 -0.108027 -0.710856
C  4.251804 -0.613456 -0.118664
C  -0.762751 4.778879 2.293404
C  6.027629 -1.035362 -1.580672
H  -0.915249 0.489644 2.004667
H  -2.627237 -2.643341 -1.421567
H  -7.034854 0.572398 -0.722026
H  -6.248107 1.510752 -1.953365
H  -5.424664 3.246084 -0.394868
H  -6.438721 2.28012 0.660713
H  -5.081959 3.165477 1.328792
H  -0.747285 -4.066378 -1.095537
H  0.741468 -3.158253 -0.863949
H  0.01328 -4.000928 0.492508
H  -5.735916 -0.600384 -3.239428
H  -6.530217 -1.544005 -1.993452
H  -7.464264 -0.392622 -2.950413
H  2.847184 -2.320025 2.434928
H  0.977782 0.0089 -0.64056
H  5.065218 -1.782118 1.483761
H  3.181934 0.529956 -1.581189
H  0.187995 4.395968 1.922475
H  -0.61521 5.230826 3.269834
H  -1.136856 5.529148 1.597228
totalener: -1581.00292871 hartree
nucrepener: 3047.45127304 hartree
electener: -4628.45420175 hartree
oneelecener: -8223.69001544 hartree
twoeener: 3595.23581369 hartree
kineticenergy: 1574.83678455 hartree
xcener: -144.864389418265 hartree
chargesum: -0.0000000
charge: -0.171357 -0.156991 -0.170871 -0.306272 -0.295695 -0.263900 -0.296518 -0.349688 -0.306921 -0.011090 0.089755 -0.019635 0.162632 0.243383 -0.064024 0.017915 -0.189599 0.084376 -0.123547 -0.263403 -0.209756 -0.239616 0.210111 -0.184402 -0.140911 0.470912 -0.100954 -0.137032 0.167210 -0.126504 0.575153 0.128301 0.106979 0.076993 0.075873 0.111132 0.098608 0.098399 0.088989 0.098607 0.107941 0.083434 0.082102 0.082319 0.125279 0.137289 0.125277 0.130053 0.114202 0.122050 0.113410
qa: -0.1714 -0.1570 -0.1709 -0.3063 -0.2957 -0.2639 -0.2965 -0.3497 -0.3069 -0.0111 0.0898 -0.0196 0.1626 0.2434 -0.0640 0.0179 -0.1896 0.0844 -0.1235 -0.2634 -0.2098 -0.2396 0.2101 -0.1844 -0.1409 0.4709 -0.1010 -0.1370 0.1672 -0.1265 0.5752 0.1283 0.1070 0.0770 0.0759 0.1111 0.0986 0.0984 0.0890 0.0986 0.1079 0.0834 0.0821 0.0823 0.1253 0.1373 0.1253 0.1301 0.1142 0.1220 0.1134
va: 1.1302 1.1522 1.1307 2.1289 2.1051 2.1254 2.1003 2.1449 3.0944 3.8147 4.1057 3.8501 3.8024 3.7140 3.8972 3.8384 4.0900 3.9477 3.8717 3.9088 3.9082 3.9595 3.8243 4.0152 3.8739 4.3658 4.0371 4.0716 3.8431 3.8873 4.6329 1.0245 1.0369 1.0029 1.0006 0.9933 1.0006 1.0167 1.0073 0.9995 0.9989 1.0119 1.0123 1.0039 1.0149 1.0093 1.0072 1.0088 0.9927 0.9947 0.9937
dispcorr: -0.024815504 hartree
energy: -1581.027744216175
dipole: -57.79792 56.85959 -0.93834 9.56881 -8.78879 0.78002 4.01178 -3.24573 0.76605
magnitude: 1.44074 au
magnitude: 3.66208 debye
