program: Orca
programVersion: 5.0.2
elementType: F F F O O O O O N C C C C C C C C C C C C C C C C C C C C C C H H H H H H H H H H H H H H H H H H H H
charge: 0
multiplicity: 1
keywords: wb97x-d3
keywords: def2-TZVPP
keywords: def2/J RIJCOSX
keywords: DEFGRID2
keywords: scfconv7
keywords: smallprint printgap noloewdin
keywords: NOSOSCF
formula: C22H20F3NO5
InChI: InChI=1/C22H20F3NO5/c1-5-17-13(3)20(30-21(27)28-4)16-11-19(12(2)10-18(16)26-17)29-14-6-8-15(9-7-14)31-22(23,24)25/h6-11H,5H2,1-4H3
51 atoms
F  6.038622 -0.960622 1.822975
F  6.552245 -1.185828 -0.24004
F  7.194301 0.565337 0.844376
O  -1.780502 2.086338 0.184557
O  0.505172 -2.340433 -0.899288
O  -0.666902 3.715623 -0.63238
O  5.111805 0.408794 0.332494
O  -2.498815 3.02537 -1.740348
N  -4.670886 -0.867092 0.181888
C  -2.367159 -0.192171 -0.099594
C  -3.384756 -1.166858 -0.082014
C  -4.069515 1.444602 0.462907
C  -5.005568 0.367046 0.444955
C  -2.771453 1.130842 0.167928
C  -1.035433 -0.57059 -0.370895
C  -1.754992 -2.8883 -0.621714
C  -3.041249 -2.508223 -0.358168
C  -0.748411 -1.885349 -0.614059
C  -6.454268 0.598188 0.779747
C  -4.498477 2.847611 0.770467
C  -1.396408 -4.312888 -0.91512
C  -6.714245 0.455193 2.278969
C  1.609082 -1.611247 -0.568563
C  2.505412 -1.295784 -1.578563
C  1.87506 -1.246459 0.744569
C  -1.727801 2.956985 -0.831753
C  3.686888 -0.640614 -1.274063
C  3.051067 -0.580424 1.04745
C  3.953054 -0.290279 0.038298
C  -0.439654 4.734953 -1.598451
C  6.201034 -0.293616 0.684966
H  -0.252619 0.175794 -0.378102
H  -3.839808 -3.239166 -0.348608
H  -6.787175 1.57762 0.431606
H  -7.041622 -0.145472 0.241151
H  -4.879889 3.344873 -0.123301
H  -5.285936 2.869448 1.521091
H  -3.678173 3.449543 1.157759
H  -2.279146 -4.947573 -0.861672
H  -0.966137 -4.422303 -1.911527
H  -0.661667 -4.6995 -0.207833
H  -6.438784 -0.542794 2.618354
H  -6.137168 1.172718 2.864293
H  -7.768068 0.611027 2.509827
H  2.280812 -1.577227 -2.598611
H  1.172265 -1.481372 1.532833
H  4.390766 -0.390914 -2.056421
H  3.256537 -0.286574 2.067903
H  -0.29842 4.319154 -2.595891
H  0.468278 5.241617 -1.284406
H  -1.263232 5.448504 -1.628022
totalener: -1581.00197082 hartree
nucrepener: 3049.23003700 hartree
electener: -4630.23200782 hartree
oneelecener: -8227.21016278 hartree
twoeener: 3596.97815495 hartree
kineticenergy: 1574.83244509 hartree
xcener: -144.863008343391 hartree
chargesum: -0.0000000
charge: -0.167548 -0.168435 -0.156800 -0.307654 -0.306329 -0.265191 -0.296594 -0.354646 -0.290780 -0.033783 0.052657 0.002544 0.208547 0.225225 -0.143712 -0.054699 -0.141218 0.224420 -0.163161 -0.297333 -0.219209 -0.257979 0.248734 -0.190731 -0.176990 0.480332 -0.099513 -0.102999 0.165084 -0.127545 0.575379 0.141439 0.101309 0.075647 0.087521 0.128621 0.100332 0.099048 0.086967 0.097301 0.094178 0.096239 0.072426 0.086562 0.129017 0.137467 0.127940 0.129423 0.113869 0.122562 0.112064
qa: -0.1675 -0.1684 -0.1568 -0.3077 -0.3063 -0.2652 -0.2966 -0.3546 -0.2908 -0.0338 0.0527 0.0025 0.2085 0.2252 -0.1437 -0.0547 -0.1412 0.2244 -0.1632 -0.2973 -0.2192 -0.2580 0.2487 -0.1907 -0.1770 0.4803 -0.0995 -0.1030 0.1651 -0.1275 0.5754 0.1414 0.1013 0.0756 0.0875 0.1286 0.1003 0.0990 0.0870 0.0973 0.0942 0.0962 0.0724 0.0866 0.1290 0.1375 0.1279 0.1294 0.1139 0.1226 0.1121
va: 1.1357 1.1337 1.1528 2.1311 2.1061 2.1245 2.0997 2.1454 3.1404 3.8695 4.1171 3.7611 3.7630 3.7822 3.8005 3.8548 4.0789 3.8709 3.8840 3.9014 3.9356 3.9121 3.8123 4.0480 3.9991 4.3629 4.0097 4.0211 3.8624 3.8885 4.6334 1.0210 1.0402 1.0003 1.0256 0.9914 1.0003 1.0080 1.0055 0.9986 1.0013 1.0078 1.0053 1.0065 1.0118 1.0022 1.0070 1.0082 0.9935 0.9945 0.9931
dispcorr: -0.024355214 hartree
energy: -1581.026326038858
dipole: -61.66809 61.44076 -0.22733 7.07659 -6.38065 0.69595 -0.94011 0.92625 -0.01386
magnitude: 0.73226 au
magnitude: 1.86127 debye
