program: Orca
programVersion: 5.0.2
elementType: F F F O O O O O N C C C C C C C C C C C C C C C C C C C C C C H H H H H H H H H H H H H H H H H H H H
charge: 0
multiplicity: 1
keywords: wb97x-d3
keywords: def2-TZVPP
keywords: def2/J RIJCOSX
keywords: DEFGRID2
keywords: scfconv7
keywords: smallprint printgap noloewdin
keywords: NOSOSCF
formula: C22H20F3NO5
InChI: InChI=1/C22H20F3NO5/c1-5-17-13(3)20(30-21(27)28-4)16-11-19(12(2)10-18(16)26-17)29-14-6-8-15(9-7-14)31-22(23,24)25/h6-11H,5H2,1-4H3
51 atoms
F  6.750201 -1.413337 -0.015311
F  7.262636 0.275359 1.221732
F  5.938895 -1.257707 1.961549
O  -1.856551 2.17794 0.014565
O  0.523778 -2.240278 -0.900398
O  -0.955368 3.79319 -1.052132
O  5.275909 0.199155 0.414711
O  -2.765964 2.809966 -1.954686
N  -4.552982 -0.880949 0.672711
C  -2.33717 -0.145962 0.044244
C  -3.287061 -1.155205 0.304024
C  -4.065863 1.472403 0.585295
C  -4.936008 0.360664 0.803656
C  -2.786169 1.180584 0.200167
C  -1.031286 -0.499635 -0.352058
C  -1.63284 -2.859615 -0.210323
C  -2.898824 -2.505259 0.167314
C  -0.702037 -1.821611 -0.471562
C  -6.382997 0.566509 1.15926
C  -4.52203 2.889444 0.760936
C  -1.21896 -4.291964 -0.35465
C  -7.219143 0.972078 -0.053746
C  1.664939 -1.595504 -0.53988
C  1.866161 -1.077135 0.734243
C  2.673575 -1.525572 -1.490421
C  -1.944299 2.922751 -1.096462
C  3.081557 -0.496219 1.052214
C  3.891333 -0.950245 -1.168205
C  4.086005 -0.438529 0.102043
C  -0.866216 4.695235 -2.147723
C  6.284158 -0.546852 0.887651
H  -0.297993 0.268744 -0.55868
H  -3.643534 -3.26247 0.377044
H  -6.755747 -0.37552 1.559962
H  -6.492025 1.310849 1.951801
H  -3.716726 3.530425 1.118128
H  -4.883037 3.307902 -0.179994
H  -5.331747 2.965166 1.483059
H  -2.042178 -4.955876 -0.097397
H  -0.910721 -4.52073 -1.375423
H  -0.376359 -4.535649 0.293573
H  -7.154994 0.213331 -0.833165
H  -8.268308 1.084214 0.219769
H  -6.887517 1.916791 -0.484892
H  1.084612 -1.126132 1.480527
H  2.5034 -1.92884 -2.479516
H  3.242554 -0.083826 2.038936
H  4.675131 -0.885064 -1.910441
H  -0.715842 4.168502 -3.089855
H  -0.005144 5.32435 -1.942313
H  -1.758878 5.315345 -2.229439
totalener: -1581.00146588 hartree
nucrepener: 3039.53816100 hartree
electener: -4620.53962689 hartree
oneelecener: -8207.80672637 hartree
twoeener: 3587.26709948 hartree
kineticenergy: 1574.84332377 hartree
xcener: -144.865392103095 hartree
chargesum: -0.0000000
charge: -0.171626 -0.156104 -0.168692 -0.306961 -0.309493 -0.264028 -0.295866 -0.354540 -0.282772 -0.022786 0.063004 -0.007037 0.192829 0.244050 -0.145845 -0.052000 -0.141208 0.205709 -0.164631 -0.317766 -0.223283 -0.258923 0.287033 -0.187366 -0.232254 0.479925 -0.097654 -0.079705 0.148706 -0.126870 0.574725 0.144406 0.102685 0.088137 0.076079 0.110410 0.123447 0.106994 0.086765 0.100386 0.094140 0.096297 0.084193 0.084430 0.137979 0.129219 0.129112 0.128347 0.114201 0.122109 0.112093
qa: -0.1716 -0.1561 -0.1687 -0.3070 -0.3095 -0.2640 -0.2959 -0.3545 -0.2828 -0.0228 0.0630 -0.0070 0.1928 0.2441 -0.1458 -0.0520 -0.1412 0.2057 -0.1646 -0.3178 -0.2233 -0.2589 0.2870 -0.1874 -0.2323 0.4799 -0.0977 -0.0797 0.1487 -0.1269 0.5747 0.1444 0.1027 0.0881 0.0761 0.1104 0.1234 0.1070 0.0868 0.1004 0.0941 0.0963 0.0842 0.0844 0.1380 0.1292 0.1291 0.1283 0.1142 0.1221 0.1121
va: 1.1307 1.1535 1.1329 2.1304 2.1083 2.1259 2.1000 2.1459 3.1451 3.8392 4.1012 3.7445 3.7962 3.7560 3.8324 3.8512 4.0750 3.8735 3.8545 3.8881 3.9380 3.9153 3.7807 3.9659 4.0617 4.3640 4.0230 4.0080 3.8710 3.8884 4.6338 1.0153 1.0405 1.0305 1.0049 1.0047 0.9918 1.0034 1.0053 0.9978 1.0010 1.0052 1.0062 1.0026 1.0029 1.0138 1.0074 1.0077 0.9933 0.9948 0.9932
dispcorr: -0.024470551 hartree
energy: -1581.025936436091
dipole: -63.40446 62.95219 -0.45227 9.58558 -8.77836 0.80722 -7.21489 6.99708 -0.21781
magnitude: 0.95058 au
magnitude: 2.41618 debye
