program: Orca
programVersion: 5.0.2
elementType: F F F O O O O O N C C C C C C C C C C C C C C C C C C C C C C H H H H H H H H H H H H H H H H H H H H
charge: 0
multiplicity: 1
keywords: wb97x-d3
keywords: def2-TZVPP
keywords: def2/J RIJCOSX
keywords: DEFGRID2
keywords: scfconv7
keywords: smallprint printgap noloewdin
keywords: NOSOSCF
formula: C22H20F3NO5
InChI: InChI=1/C22H20F3NO5/c1-5-17-13(3)20(30-21(27)28-4)16-11-19(12(2)10-18(16)26-17)29-14-6-8-15(9-7-14)31-22(23,24)25/h6-11H,5H2,1-4H3
51 atoms
F  7.240606 0.301491 1.158466
F  5.845518 -0.95731 2.210157
F  6.546065 -1.531283 0.266908
O  -1.748525 2.210554 -0.061245
O  0.494105 -2.304591 -0.805464
O  -0.729215 3.766024 -1.11364
O  5.211245 0.239174 0.445882
O  -2.586212 2.900339 -2.042127
N  -4.615917 -0.725585 0.432573
C  -2.336859 -0.088824 -0.06192
C  -3.343307 -1.055589 0.132838
C  -4.008818 1.600326 0.422216
C  -4.942387 0.527603 0.570732
C  -2.730528 1.257726 0.086451
C  -1.026214 -0.495895 -0.380628
C  -1.733878 -2.827529 -0.290422
C  -3.006535 -2.419496 0.00413
C  -0.742618 -1.830605 -0.478548
C  -6.379561 0.840738 0.896323
C  -4.436322 3.023491 0.608308
C  -1.375139 -4.276354 -0.418083
C  -7.302287 -0.3647 0.891481
C  1.625687 -1.63024 -0.464616
C  1.80956 -1.064326 0.791716
C  2.639176 -1.577105 -1.410155
C  -1.770921 2.960232 -1.17293
C  3.011834 -0.450625 1.098292
C  3.845684 -0.97342 -1.09801
C  4.023433 -0.413195 0.154067
C  -0.568482 4.657229 -2.210471
C  6.189702 -0.484461 1.011326
H  -0.252072 0.243625 -0.535536
H  -3.795176 -3.145192 0.157108
H  -6.421664 1.33155 1.875275
H  -6.745969 1.590654 0.187988
H  -4.924329 3.406505 -0.290075
H  -5.143817 3.120324 1.43033
H  -3.597602 3.679058 0.834394
H  -2.241503 -4.904476 -0.219204
H  -1.012319 -4.514086 -1.418806
H  -0.587347 -4.56012 0.280789
H  -6.995941 -1.10564 1.627022
H  -8.321278 -0.054641 1.122745
H  -7.30914 -0.856156 -0.079844
H  1.022204 -1.099491 1.532695
H  2.483072 -2.017724 -2.385472
H  3.15498 0.000531 2.070586
H  4.63641 -0.92496 -1.834221
H  -0.436372 4.118614 -3.148677
H  0.326274 5.23329 -1.993869
H  -1.42042 5.330077 -2.307832
totalener: -1581.00259586 hartree
nucrepener: 3042.48338436 hartree
electener: -4623.48598022 hartree
oneelecener: -8213.79852778 hartree
twoeener: 3590.31254756 hartree
kineticenergy: 1574.84851969 hartree
xcener: -144.868303966035 hartree
chargesum: 0.0000000
charge: -0.155584 -0.170132 -0.169262 -0.307800 -0.308822 -0.264682 -0.296525 -0.352441 -0.309131 -0.016120 0.040444 -0.006728 0.187503 0.246767 -0.158738 -0.054473 -0.142771 0.224493 -0.127074 -0.287725 -0.221976 -0.240641 0.286816 -0.197849 -0.223466 0.476916 -0.094690 -0.083113 0.150328 -0.126920 0.575982 0.144942 0.104728 0.074013 0.079420 0.124946 0.102145 0.097330 0.086369 0.099422 0.094549 0.081618 0.081187 0.082989 0.139144 0.128818 0.129652 0.127675 0.114218 0.122087 0.112163
qa: -0.1556 -0.1701 -0.1693 -0.3078 -0.3088 -0.2647 -0.2965 -0.3524 -0.3091 -0.0161 0.0404 -0.0067 0.1875 0.2468 -0.1587 -0.0545 -0.1428 0.2245 -0.1271 -0.2877 -0.2220 -0.2406 0.2868 -0.1978 -0.2235 0.4769 -0.0947 -0.0831 0.1503 -0.1269 0.5760 0.1449 0.1047 0.0740 0.0794 0.1249 0.1021 0.0973 0.0864 0.0994 0.0945 0.0816 0.0812 0.0830 0.1391 0.1288 0.1297 0.1277 0.1142 0.1221 0.1122
va: 1.1547 1.1321 1.1329 2.1304 2.1105 2.1254 2.0998 2.1476 3.1013 3.8458 4.1512 3.8290 3.7615 3.7585 3.8280 3.8487 4.0495 3.8651 3.8788 3.9043 3.9375 3.9594 3.7789 3.9796 4.0579 4.3669 4.0217 4.0021 3.8730 3.8883 4.6321 1.0156 1.0355 1.0022 0.9983 0.9931 1.0015 1.0093 1.0054 0.9978 1.0012 1.0131 1.0039 1.0114 1.0020 1.0136 1.0082 1.0069 0.9932 0.9948 0.9933
dispcorr: -0.024088011 hartree
energy: -1581.026683873231
dipole: -62.83369 62.50169 -0.33200 6.65322 -5.88861 0.76461 -6.28373 6.08787 -0.19586
magnitude: 0.85628 au
magnitude: 2.17649 debye
