program: Orca
programVersion: 5.0.2
elementType: F F F O O O O O N C C C C C C C C C C C C C C C C C C C C C C H H H H H H H H H H H H H H H H H H H H
charge: 0
multiplicity: 1
keywords: wb97x-d3
keywords: def2-TZVPP
keywords: def2/J RIJCOSX
keywords: DEFGRID2
keywords: scfconv7
keywords: smallprint printgap noloewdin
keywords: NOSOSCF
formula: C22H20F3NO5
InChI: InChI=1/C22H20F3NO5/c1-5-17-13(3)20(30-21(27)28-4)16-11-19(12(2)10-18(16)26-17)29-14-6-8-15(9-7-14)31-22(23,24)25/h6-11H,5H2,1-4H3
51 atoms
F  5.288283 -0.793457 -2.622503
F  7.228588 -0.710331 -1.691855
F  5.940255 -2.408333 -1.371339
O  -2.861397 1.99361 1.873552
O  0.53531 -1.742568 1.552158
O  -1.630211 3.559963 2.649306
O  5.502706 -0.438228 -0.436966
O  -1.649395 3.227315 0.423727
N  -4.137011 -0.586759 -1.094899
C  -2.512883 0.014843 0.589522
C  -2.989722 -0.83379 -0.429188
C  -4.450024 1.418125 0.196845
C  -4.837638 0.471168 -0.804221
C  -3.289708 1.160039 0.865854
C  -1.312555 -0.306848 1.252549
C  -1.065444 -2.290976 -0.143024
C  -2.243846 -1.981583 -0.76946
C  -0.618161 -1.422667 0.882745
C  -6.110243 0.694789 -1.577067
C  -5.279881 2.635963 0.46248
C  -0.274594 -3.511798 -0.501339
C  -6.394866 -0.35575 -2.635995
C  1.727609 -1.393576 1.000999
C  1.855428 -0.493055 -0.049153
C  2.859403 -1.977984 1.559822
C  -2.001066 2.964815 1.533243
C  3.115897 -0.184745 -0.540756
C  4.112401 -1.670378 1.064715
C  4.234368 -0.777191 0.01291
C  -0.690949 4.619111 2.507527
C  5.973233 -1.083062 -1.513157
H  -0.935452 0.306909 2.059979
H  -2.636736 -2.618123 -1.552096
H  -6.947019 0.742083 -0.871509
H  -6.073557 1.687796 -2.037713
H  -4.98927 3.142434 1.379363
H  -5.191647 3.353875 -0.355594
H  -6.336267 2.384046 0.554475
H  -0.80675 -4.111841 -1.236932
H  0.697786 -3.255455 -0.925641
H  -0.088568 -4.137856 0.371709
H  -6.485075 -1.348219 -2.19851
H  -7.327468 -0.123951 -3.150139
H  -5.599144 -0.400033 -3.377291
H  0.98701 -0.018901 -0.486186
H  2.750165 -2.673844 2.380796
H  3.215088 0.529611 -1.346474
H  4.994817 -2.119022 1.500604
H  0.245948 4.265912 2.076744
H  -0.510866 4.990159 3.512128
H  -1.083228 5.424197 1.886504
totalener: -1581.00273708 hartree
nucrepener: 3051.63008372 hartree
electener: -4632.63282079 hartree
oneelecener: -8232.03492055 hartree
twoeener: 3599.40209975 hartree
kineticenergy: 1574.84583455 hartree
xcener: -144.865853639077 hartree
chargesum: -0.0000000
charge: -0.172675 -0.156933 -0.169489 -0.307436 -0.296309 -0.264076 -0.296427 -0.350871 -0.306638 -0.007448 0.087461 -0.012442 0.164843 0.240722 -0.085317 0.018636 -0.189635 0.094217 -0.123490 -0.267796 -0.207985 -0.239583 0.198670 -0.135293 -0.176796 0.473325 -0.137787 -0.102515 0.166356 -0.127012 0.575937 0.130561 0.107559 0.077004 0.076450 0.098505 0.114241 0.098980 0.089142 0.097953 0.107198 0.081830 0.082657 0.083413 0.137934 0.124878 0.130366 0.125097 0.114076 0.122228 0.113713
qa: -0.1727 -0.1569 -0.1695 -0.3074 -0.2963 -0.2641 -0.2964 -0.3509 -0.3066 -0.0074 0.0875 -0.0124 0.1648 0.2407 -0.0853 0.0186 -0.1896 0.0942 -0.1235 -0.2678 -0.2080 -0.2396 0.1987 -0.1353 -0.1768 0.4733 -0.1378 -0.1025 0.1664 -0.1270 0.5759 0.1306 0.1076 0.0770 0.0765 0.0985 0.1142 0.0990 0.0891 0.0980 0.1072 0.0818 0.0827 0.0834 0.1379 0.1249 0.1304 0.1251 0.1141 0.1222 0.1137
va: 1.1287 1.1525 1.1319 2.1287 2.1049 2.1259 2.1008 2.1442 3.0943 3.8043 4.1108 3.8472 3.7987 3.7198 3.8983 3.8442 4.0917 3.9352 3.8737 3.9091 3.9101 3.9593 3.8359 3.8737 4.0095 4.3637 4.0744 4.0372 3.8421 3.8874 4.6305 1.0257 1.0366 1.0029 1.0001 1.0155 0.9928 1.0009 1.0072 0.9997 0.9993 1.0123 1.0039 1.0120 1.0087 1.0148 1.0100 1.0066 0.9930 0.9947 0.9934
dispcorr: -0.024867730 hartree
energy: -1581.027604808018
dipole: -56.86507 55.96898 -0.89609 10.19977 -9.46088 0.73890 3.37427 -2.59328 0.78099
magnitude: 1.39961 au
magnitude: 3.55751 debye
