program: Orca
programVersion: 5.0.2
elementType: F F F O O O O O N C C C C C C C C C C C C C C C C C C C C C C H H H H H H H H H H H H H H H H H H H H
charge: 0
multiplicity: 1
keywords: wb97x-d3
keywords: def2-TZVPP
keywords: def2/J RIJCOSX
keywords: DEFGRID2
keywords: scfconv7
keywords: smallprint printgap noloewdin
keywords: NOSOSCF
formula: C22H20F3NO5
InChI: InChI=1/C22H20F3NO5/c1-5-17-13(3)20(30-21(27)28-4)16-11-19(12(2)10-18(16)26-17)29-14-6-8-15(9-7-14)31-22(23,24)25/h6-11H,5H2,1-4H3
51 atoms
F  6.42976 -0.692973 0.474187
F  5.777398 0.03283 -1.434933
F  6.664784 1.391107 -0.016634
O  -1.798873 1.836468 1.165725
O  0.334481 -2.683482 0.094251
O  -0.006601 2.994093 1.059223
O  4.680409 0.679023 0.38846
O  -0.891477 2.233236 -0.86503
N  -4.739448 -0.626679 -0.383742
C  -2.444471 -0.296671 0.295776
C  -3.481452 -1.090055 -0.230067
C  -4.047067 1.512303 0.472199
C  -5.019215 0.59993 -0.048451
C  -2.778707 1.033543 0.626913
C  -1.156317 -0.841607 0.445022
C  -1.927571 -2.941092 -0.518081
C  -3.188297 -2.415558 -0.61609
C  -0.905966 -2.115829 0.016258
C  -6.437454 1.069926 -0.235814
C  -4.426881 2.921531 0.807788
C  -1.616692 -4.340058 -0.953442
C  -7.376878 0.026685 -0.813818
C  1.423692 -1.862244 0.13304
C  1.651414 -0.925541 -0.869235
C  2.308858 -1.987354 1.190964
C  -0.889578 2.349122 0.322843
C  2.759235 -0.101579 -0.796931
C  3.424965 -1.165949 1.259578
C  3.632448 -0.220218 0.272787
C  1.085519 3.57818 0.359888
C  5.866049 0.346518 -0.142906
H  -0.36715 -0.257887 0.898047
H  -3.999972 -3.010146 -1.01568
H  -6.823603 1.419708 0.72798
H  -6.433582 1.959369 -0.875248
H  -5.275995 2.948886 1.492016
H  -3.614649 3.468573 1.278922
H  -4.722537 3.471809 -0.087603
H  -2.507807 -4.825153 -1.347395
H  -0.852864 -4.358494 -1.731692
H  -1.243102 -4.946286 -0.12733
H  -7.043377 -0.311781 -1.793043
H  -7.441232 -0.85081 -0.173081
H  -8.377678 0.445173 -0.920242
H  0.956668 -0.822544 -1.69224
H  2.119746 -2.719423 1.964373
H  2.932658 0.641271 -1.563862
H  4.10704 -1.244659 2.094974
H  1.688099 4.074635 1.114725
H  0.749375 4.307281 -0.377143
H  1.687832 2.818923 -0.139746
totalener: -1581.00205428 hartree
nucrepener: 3122.69798249 hartree
electener: -4703.70003677 hartree
oneelecener: -8374.05450397 hartree
twoeener: 3670.35446720 hartree
kineticenergy: 1574.84517902 hartree
xcener: -144.867295920230 hartree
chargesum: 0.0000000
charge: -0.169283 -0.167235 -0.156007 -0.304187 -0.313011 -0.263072 -0.300842 -0.350149 -0.308742 0.024847 0.041954 -0.047597 0.173392 0.251531 -0.127023 -0.039275 -0.152059 0.191990 -0.119344 -0.264245 -0.215886 -0.240340 0.245332 -0.148459 -0.187076 0.468067 -0.172849 -0.098474 0.198151 -0.119827 0.574105 0.139933 0.104312 0.075154 0.074082 0.097376 0.097492 0.106282 0.086368 0.094609 0.097451 0.082357 0.082218 0.081639 0.140078 0.129655 0.136657 0.128732 0.123939 0.116629 0.100651
qa: -0.1693 -0.1672 -0.1560 -0.3042 -0.3130 -0.2631 -0.3008 -0.3501 -0.3087 0.0248 0.0420 -0.0476 0.1734 0.2515 -0.1270 -0.0393 -0.1521 0.1920 -0.1193 -0.2642 -0.2159 -0.2403 0.2453 -0.1485 -0.1871 0.4681 -0.1728 -0.0985 0.1982 -0.1198 0.5741 0.1399 0.1043 0.0752 0.0741 0.0974 0.0975 0.1063 0.0864 0.0946 0.0975 0.0824 0.0822 0.0816 0.1401 0.1297 0.1367 0.1287 0.1239 0.1166 0.1007
va: 1.1339 1.1348 1.1537 2.1292 2.1075 2.1236 2.0854 2.1422 3.1030 3.8404 4.1479 3.8633 3.7887 3.7390 3.7717 3.8466 4.0588 3.8987 3.8661 3.9125 3.9326 3.9603 3.8150 3.9471 4.0528 4.3681 3.9729 4.0282 3.7909 3.8907 4.6384 1.0134 1.0349 1.0026 1.0011 1.0001 1.0179 0.9941 1.0056 1.0013 0.9984 1.0124 1.0121 1.0038 1.0041 1.0113 1.0044 1.0079 0.9957 0.9951 0.9891
dispcorr: -0.026063034 hartree
energy: -1581.028117310536
dipole: -59.25037 59.02604 -0.22433 1.25161 -0.80603 0.44558 -1.75523 2.12840 0.37317
magnitude: 0.62300 au
magnitude: 1.58353 debye
