program: Orca
programVersion: 5.0.2
elementType: O N N N N N C C C C C C C C C C C C C C C C H H H H H H H H H H H H H H H H H H H H H H H
charge: 0
multiplicity: 1
keywords: wb97x-d3
keywords: def2-TZVPP
keywords: def2/J RIJCOSX
keywords: DEFGRID2
keywords: scfconv7
keywords: smallprint printgap noloewdin
keywords: NOSOSCF
formula: C16H23N5O
InChI: InChI=1/C16H23N5O/c1-6-20(14-7-8-17-18-9-14)16(22)15-10-19-21(13(15)5)12(4)11(2)3/h7-12H,6H2,1-5H3
45 atoms
O  1.181114 -2.492809 0.933971
N  -2.031455 0.060158 -0.066212
N  -1.517544 1.135642 0.54308
N  2.409402 -0.610007 0.682282
N  2.227987 1.824419 -2.051693
N  2.88223 2.8582 -1.560572
C  -3.428735 0.086702 -0.48852
C  -4.354942 0.163449 0.734962
C  -3.644402 1.204991 -1.49667
C  -1.168067 -0.966404 -0.130931
C  -5.815755 0.082767 0.305637
C  -4.04547 -0.939406 1.740966
C  0.003346 -0.51165 0.464136
C  -0.287716 0.808806 0.857459
C  -1.487824 -2.268774 -0.76907
C  1.220851 -1.293227 0.686065
C  3.633541 -1.298304 1.1047
C  2.57804 0.583616 -0.035815
C  4.341341 -1.991495 -0.04128
C  3.28841 1.651196 0.463354
C  2.082187 0.729399 -1.336879
C  3.402978 2.770877 -0.351169
H  -3.60919 -0.86861 -0.985684
H  -4.193928 1.132483 1.218797
H  -2.909533 1.149958 -2.299786
H  -4.628551 1.119884 -1.953916
H  -3.572514 2.188241 -1.031547
H  -6.114718 0.920113 -0.324221
H  -6.468358 0.088987 1.179511
H  -6.014134 -0.839325 -0.246046
H  -4.729552 -0.881452 2.588796
H  -3.033325 -0.872928 2.142035
H  -4.164188 -1.928249 1.291402
H  0.345578 1.512924 1.375606
H  -0.581656 -2.839137 -0.951055
H  -2.140679 -2.872556 -0.137204
H  -1.989228 -2.131197 -1.726525
H  4.289149 -0.561563 1.566382
H  3.372226 -2.006069 1.887416
H  3.711676 -2.75314 -0.499391
H  4.640627 -1.283184 -0.8146
H  5.24424 -2.479477 0.326476
H  3.731081 1.646146 1.449895
H  1.551815 -0.079534 -1.823337
H  3.936077 3.645728 -0.003239
elementType: O N C H
totalener: -972.61540248 hartree
nucrepener: 1869.71342295 hartree
electener: -2842.32882543 hartree
oneelecener: -5033.34414330 hartree
twoeener: 2191.01531787 hartree
cpcmener: -0.04563879 hartree
kineticenergy: 968.30270529 hartree
xcener: -95.348736270007 hartree
chargesum: -0.0000000
charge: -0.538549 0.210249 -0.357639 -0.051181 -0.174009 -0.220575 0.019646 0.072787 -0.295618 -0.075702 -0.307674 -0.306712 -0.090713 -0.101770 -0.271963 0.439520 -0.034337 0.031100 -0.252411 -0.125026 -0.004140 0.008433 0.091959 0.043533 0.103379 0.102280 0.094492 0.097869 0.093085 0.089915 0.101556 0.092127 0.087280 0.162991 0.103408 0.125445 0.114622 0.105390 0.090357 0.087477 0.090638 0.101553 0.158633 0.136286 0.152009
qa: -0.5385 0.2102 -0.3576 -0.0512 -0.1740 -0.2206 0.0196 0.0728 -0.2956 -0.0757 -0.3077 -0.3067 -0.0907 -0.1018 -0.2720 0.4395 -0.0343 0.0311 -0.2524 -0.1250 -0.0041 0.0084 0.0920 0.0435 0.1034 0.1023 0.0945 0.0979 0.0931 0.0899 0.1016 0.0921 0.0873 0.1630 0.1034 0.1254 0.1146 0.1054 0.0904 0.0875 0.0906 0.1016 0.1586 0.1363 0.1520
va: 1.9532 3.2899 2.8851 3.0837 2.9811 2.9422 3.8660 3.7920 3.9605 3.9696 3.9470 3.9386 3.4092 4.1354 3.9723 4.0270 3.8441 3.7780 3.8981 3.9561 4.1177 4.0823 1.0067 1.0320 1.0071 1.0006 1.0078 1.0010 1.0047 0.9994 1.0063 1.0030 1.0027 1.0027 1.0135 0.9892 0.9962 1.0009 1.0192 1.0134 1.0003 1.0067 0.9970 1.0221 1.0039
dispcorr: -0.023771896 hartree
energy: -972.639174372404
dipole: -22.33140 22.27369 -0.05770 -9.20326 8.44356 -0.75971 1.85324 -0.93742 0.91582
magnitude: 1.19130 au
magnitude: 3.02805 debye
