program: Orca
programVersion: 5.0.2
elementType: O N N N N N C C C C C C C C C C C C C C C C H H H H H H H H H H H H H H H H H H H H H H H
charge: 0
multiplicity: 1
keywords: wb97x-d3
keywords: def2-TZVPP
keywords: def2/J RIJCOSX
keywords: DEFGRID2
keywords: scfconv7
keywords: smallprint printgap noloewdin
keywords: NOSOSCF
formula: C16H23N5O
InChI: InChI=1/C16H23N5O/c1-6-20(14-7-8-17-18-9-14)16(22)15-10-19-21(13(15)5)12(4)11(2)3/h7-12H,6H2,1-5H3
45 atoms
O  1.792197 -2.622023 -1.451146
N  -1.9729 -0.705044 -0.129083
N  -2.095683 -1.012468 -1.425588
N  2.391198 -0.772214 -0.301094
N  1.145493 2.667286 -0.487422
N  1.594418 3.201088 0.631519
C  -3.148241 -0.290447 0.634494
C  -3.553393 1.169743 0.363462
C  -4.28756 -1.277774 0.444303
C  -0.705188 -0.818407 0.314675
C  -2.416015 2.135861 0.669857
C  -4.115698 1.429008 -1.02908
C  0.040036 -1.226988 -0.782747
C  -0.892227 -1.34507 -1.826777
C  -0.295074 -0.609622 1.72679
C  1.455914 -1.592679 -0.881462
C  3.727858 -1.321335 -0.038455
C  2.128595 0.551601 0.056659
C  3.762919 -2.260259 1.152303
C  2.632775 1.124358 1.205182
C  1.394608 1.408488 -0.777186
C  2.324039 2.457269 1.440685
H  -2.844412 -0.337248 1.681059
H  -4.354831 1.360791 1.085094
H  -5.134143 -0.971241 1.058438
H  -4.626752 -1.333899 -0.588086
H  -3.993555 -2.278739 0.760185
H  -2.764357 3.167889 0.60839
H  -1.594687 2.031133 -0.041543
H  -2.013319 1.985778 1.673007
H  -3.357707 1.307171 -1.802833
H  -4.48369 2.454342 -1.092429
H  -4.951299 0.772286 -1.27188
H  -0.7114 -1.637226 -2.850285
H  0.688419 -1.039782 1.902457
H  -0.253069 0.448754 1.987592
H  -0.984386 -1.09384 2.418441
H  4.075442 -1.827871 -0.937614
H  4.403178 -0.482016 0.116136
H  3.46523 -1.75562 2.071641
H  3.110247 -3.121059 1.010168
H  4.777578 -2.634205 1.290144
H  3.227204 0.574423 1.921481
H  1.01024 1.067201 -1.729412
H  2.679741 2.945787 2.338247
elementType: O N C H
totalener: -972.61146575 hartree
nucrepener: 1929.62410585 hartree
electener: -2902.23557160 hartree
oneelecener: -5152.61434327 hartree
twoeener: 2250.37877166 hartree
cpcmener: -0.04896473 hartree
kineticenergy: 968.29260827 hartree
xcener: -95.351016420614 hartree
chargesum: 0.0000000
charge: -0.516404 0.194447 -0.372261 -0.037442 -0.180054 -0.227180 0.075691 0.057691 -0.309738 -0.068130 -0.330163 -0.304855 -0.085517 -0.100486 -0.261977 0.386838 -0.033097 0.143558 -0.267320 -0.135900 -0.092722 -0.012644 0.099399 0.043808 0.102294 0.092090 0.107120 0.107530 0.076329 0.103758 0.081374 0.096416 0.096199 0.161255 0.114417 0.119000 0.133023 0.096208 0.106466 0.087809 0.094107 0.105291 0.161953 0.139261 0.152558
qa: -0.5164 0.1944 -0.3723 -0.0374 -0.1801 -0.2272 0.0757 0.0577 -0.3097 -0.0681 -0.3302 -0.3049 -0.0855 -0.1005 -0.2620 0.3868 -0.0331 0.1436 -0.2673 -0.1359 -0.0927 -0.0126 0.0994 0.0438 0.1023 0.0921 0.1071 0.1075 0.0763 0.1038 0.0814 0.0964 0.0962 0.1613 0.1144 0.1190 0.1330 0.0962 0.1065 0.0878 0.0941 0.1053 0.1620 0.1393 0.1526
va: 1.9786 3.3186 2.8728 3.0812 2.9556 2.9467 3.8344 3.8433 3.9590 3.9239 3.9504 3.9316 3.4111 4.1258 3.9698 4.1045 3.8235 3.7513 3.9132 3.9190 4.1410 4.0996 1.0019 1.0188 1.0026 1.0086 1.0041 1.0074 1.0051 1.0001 1.0154 1.0062 1.0008 1.0065 0.9996 0.9873 0.9996 1.0191 0.9988 1.0027 1.0061 1.0071 0.9968 1.0247 1.0047
dispcorr: -0.026884666 hartree
energy: -972.638350420458
dipole: -14.08281 14.90359 0.82078 -0.34794 0.02920 -0.31873 11.10296 -7.89771 3.20525
magnitude: 3.32399 au
magnitude: 8.44891 debye
