program: Orca
programVersion: 5.0.2
elementType: O N N N N N C C C C C C C C C C C C C C C C H H H H H H H H H H H H H H H H H H H H H H H
charge: 0
multiplicity: 1
keywords: wb97x-d3
keywords: def2-TZVPP
keywords: def2/J RIJCOSX
keywords: DEFGRID2
keywords: scfconv7
keywords: smallprint printgap noloewdin
keywords: NOSOSCF
formula: C16H23N5O
InChI: InChI=1/C16H23N5O/c1-6-20(14-7-8-17-18-9-14)16(22)15-10-19-21(13(15)5)12(4)11(2)3/h7-12H,6H2,1-5H3
45 atoms
O  1.845502 -2.712565 -1.087421
N  -2.051329 -0.740625 -0.254629
N  -1.982705 -1.050723 -1.55439
N  2.260859 -0.969303 0.291676
N  2.050014 2.157366 2.183268
N  1.564955 3.005046 1.300359
C  -3.285069 -0.192075 0.300679
C  -3.520373 1.271364 -0.122872
C  -4.462196 -1.110124 0.019519
C  -0.875717 -0.900989 0.383393
C  -2.293057 2.135307 0.140981
C  -4.003649 1.458871 -1.555912
C  0.016756 -1.346984 -0.582205
C  -0.745197 -1.434079 -1.760092
C  -0.697304 -0.697473 1.843676
C  1.429422 -1.726845 -0.491792
C  3.637715 -1.429194 0.510441
C  1.994002 0.377881 0.582765
C  4.600535 -0.932061 -0.550594
C  1.509969 1.272534 -0.346531
C  2.254789 0.898056 1.854763
C  1.302227 2.578053 0.078832
H  -3.13099 -0.175667 1.379991
H  -4.320977 1.615046 0.540846
H  -4.30043 -2.093865 0.460471
H  -5.363404 -0.690862 0.466899
H  -4.647223 -1.242167 -1.044755
H  -1.470049 1.876727 -0.528336
H  -1.935429 2.040568 1.167791
H  -2.52558 3.187806 -0.027353
H  -3.243754 1.175442 -2.283672
H  -4.244934 2.509129 -1.727607
H  -4.904871 0.884246 -1.770937
H  -0.418478 -1.741804 -2.7420
H  -0.654872 0.360157 2.107445
H  -1.513887 -1.146068 2.409594
H  0.22189 -1.167833 2.182725
H  3.955805 -1.088637 1.494747
H  3.629661 -2.515658 0.552064
H  4.323033 -1.282774 -1.543954
H  4.644332 0.157496 -0.57128
H  5.604007 -1.298611 -0.333959
H  1.298705 0.992439 -1.369241
H  2.637647 0.268723 2.648028
H  0.918508 3.320759 -0.60795
elementType: O N C H
totalener: -972.61194438 hartree
nucrepener: 1929.05685631 hartree
electener: -2901.66880069 hartree
oneelecener: -5151.02264825 hartree
twoeener: 2249.35384756 hartree
cpcmener: -0.04618382 hartree
kineticenergy: 968.29978784 hartree
xcener: -95.351480841352 hartree
chargesum: 0.0000000
charge: -0.533055 0.191727 -0.372691 -0.053500 -0.179518 -0.204769 0.069431 0.056875 -0.309420 -0.066428 -0.331091 -0.302781 -0.082184 -0.109901 -0.279484 0.431109 -0.022168 0.056490 -0.257359 -0.088374 -0.054703 -0.036440 0.100099 0.047752 0.106345 0.103877 0.091889 0.076770 0.107549 0.109889 0.082065 0.096533 0.095364 0.158511 0.121141 0.132526 0.118116 0.102081 0.091643 0.087244 0.091536 0.102164 0.149525 0.146322 0.159289
qa: -0.5331 0.1917 -0.3727 -0.0535 -0.1795 -0.2048 0.0694 0.0569 -0.3094 -0.0664 -0.3311 -0.3028 -0.0822 -0.1099 -0.2795 0.4311 -0.0222 0.0565 -0.2574 -0.0884 -0.0547 -0.0364 0.1001 0.0478 0.1063 0.1039 0.0919 0.0768 0.1075 0.1099 0.0821 0.0965 0.0954 0.1585 0.1211 0.1325 0.1181 0.1021 0.0916 0.0872 0.0915 0.1022 0.1495 0.1463 0.1593
va: 1.9613 3.3160 2.8739 3.0505 2.9878 2.9252 3.8390 3.8376 3.9623 3.9351 3.9552 3.9267 3.4206 4.1369 3.9606 4.0497 3.8444 3.7606 3.9045 3.9131 4.1393 4.0784 1.0015 1.0192 1.0046 1.0017 1.0072 0.9981 1.0001 1.0063 1.0186 1.0055 1.0005 1.0088 0.9879 0.9982 1.0031 1.0032 1.0181 1.0140 0.9992 1.0060 1.0062 1.0163 1.0019
dispcorr: -0.027080128 hartree
energy: -972.639024506745
dipole: -14.59836 14.04500 -0.55336 3.89702 -3.61096 0.28607 -0.25151 1.16993 0.91842
magnitude: 1.10974 au
magnitude: 2.82075 debye
