program: Orca
programVersion: 5.0.2
elementType: O N N N N N C C C C C C C C C C C C C C C C H H H H H H H H H H H H H H H H H H H H H H H
charge: 0
multiplicity: 1
keywords: wb97x-d3
keywords: def2-TZVPP
keywords: def2/J RIJCOSX
keywords: DEFGRID2
keywords: scfconv7
keywords: smallprint printgap noloewdin
keywords: NOSOSCF
formula: C16H23N5O
InChI: InChI=1/C16H23N5O/c1-6-20(14-7-8-17-18-9-14)16(22)15-10-19-21(13(15)5)12(4)11(2)3/h7-12H,6H2,1-5H3
45 atoms
O  1.59453 -2.851008 1.00739
N  -1.82909 -0.087403 0.325882
N  -1.95406 -0.581004 1.561488
N  2.425194 -0.905144 0.212219
N  1.596878 2.568775 1.028249
N  2.078748 3.233545 -0.00435
C  -2.920478 0.695099 -0.246468
C  -4.20727 -0.138582 -0.306362
C  -3.057025 2.006419 0.514392
C  -0.644549 -0.378522 -0.238729
C  -5.343745 0.667146 -0.925741
C  -3.989034 -1.427624 -1.091787
C  0.049237 -1.116086 0.710886
C  -0.833706 -1.222435 1.798084
C  -0.275782 0.011928 -1.622865
C  1.395694 -1.693759 0.664675
C  3.675267 -1.558567 -0.194857
C  2.327363 0.483948 0.100704
C  3.574339 -2.26044 -1.536134
C  2.873697 1.186037 -0.951946
C  1.7172 1.261225 1.096921
C  2.7105 2.565529 -0.949562
H  -2.62015 0.922452 -1.271452
H  -4.491785 -0.395929 0.718745
H  -3.452335 1.850348 1.518546
H  -2.089715 2.50286 0.598659
H  -3.725543 2.686195 -0.010528
H  -5.622674 1.529793 -0.321085
H  -6.234233 0.045853 -1.029448
H  -5.077222 1.02842 -1.921892
H  -4.91089 -2.00913 -1.135842
H  -3.226593 -2.067517 -0.645998
H  -3.686401 -1.214375 -2.119952
H  -0.666661 -1.715017 2.744126
H  0.627867 -0.505476 -1.936749
H  -1.061062 -0.253688 -2.331224
H  -0.100622 1.08564 -1.708486
H  4.451204 -0.795817 -0.21917
H  3.965788 -2.260492 0.585619
H  2.818615 -3.045241 -1.527289
H  3.331485 -1.563884 -2.338659
H  4.530834 -2.725641 -1.775167
H  3.388941 0.706383 -1.772139
H  1.32227 0.806518 1.995449
H  3.100789 3.158664 -1.766106
elementType: O N C H
totalener: -972.61330623 hartree
nucrepener: 1905.88382705 hartree
electener: -2878.49713328 hartree
oneelecener: -5104.91990031 hartree
twoeener: 2226.42276703 hartree
cpcmener: -0.04886346 hartree
kineticenergy: 968.29684901 hartree
xcener: -95.349591565625 hartree
chargesum: 0.0000000
charge: -0.516751 0.241156 -0.361750 -0.044840 -0.173068 -0.227660 0.011089 0.076046 -0.295595 -0.120210 -0.304190 -0.303223 -0.030659 -0.132016 -0.278908 0.395909 -0.034763 0.127327 -0.266709 -0.124308 -0.079448 -0.020334 0.093624 0.042564 0.096111 0.096747 0.103337 0.096644 0.092446 0.090163 0.100070 0.091958 0.086156 0.162212 0.110727 0.133248 0.125218 0.106444 0.097095 0.093786 0.088053 0.104847 0.161778 0.136987 0.152691
qa: -0.5168 0.2412 -0.3617 -0.0448 -0.1731 -0.2277 0.0111 0.0760 -0.2956 -0.1202 -0.3042 -0.3032 -0.0307 -0.1320 -0.2789 0.3959 -0.0348 0.1273 -0.2667 -0.1243 -0.0794 -0.0203 0.0936 0.0426 0.0961 0.0967 0.1033 0.0966 0.0924 0.0902 0.1001 0.0920 0.0862 0.1622 0.1107 0.1332 0.1252 0.1064 0.0971 0.0938 0.0881 0.1048 0.1618 0.1370 0.1527
va: 1.9767 3.2626 2.8675 3.0871 2.9668 2.9488 3.8732 3.7825 3.9622 3.9454 3.9464 3.9322 3.3625 4.1608 3.9845 4.0934 3.8255 3.7675 3.9119 3.9109 4.1603 4.1062 1.0063 1.0363 1.0068 1.0108 1.0005 1.0009 1.0048 0.9995 1.0057 1.0056 1.0039 1.0083 1.0003 0.9970 0.9864 0.9992 1.0179 1.0069 1.0025 1.0067 0.9962 1.0248 1.0052
dispcorr: -0.025597926 hartree
energy: -972.638904153412
dipole: -18.40434 19.17348 0.76915 -2.13439 2.29690 0.16252 -15.09183 11.95029 -3.14154
magnitude: 3.23841 au
magnitude: 8.23138 debye
