program: Orca
programVersion: 5.0.2
elementType: O N N N N N C C C C C C C C C C C C C C C C H H H H H H H H H H H H H H H H H H H H H H H
charge: 0
multiplicity: 1
keywords: wb97x-d3
keywords: def2-TZVPP
keywords: def2/J RIJCOSX
keywords: DEFGRID2
keywords: scfconv7
keywords: smallprint printgap noloewdin
keywords: NOSOSCF
formula: C16H23N5O
InChI: InChI=1/C16H23N5O/c1-6-20(14-7-8-17-18-9-14)16(22)15-10-19-21(13(15)5)12(4)11(2)3/h7-12H,6H2,1-5H3
45 atoms
O  1.470977 -2.770098 0.336017
N  -2.089407 -0.626885 -0.451429
N  -1.572743 0.064063 -1.475216
N  2.457249 -0.834636 -0.301576
N  3.128344 2.679908 -1.07661
N  2.428248 3.321983 -0.166502
C  -3.514192 -0.536122 -0.129492
C  -3.787734 0.613356 0.85949
C  -4.347837 -0.492286 -1.397901
C  -1.159761 -1.315481 0.234116
C  -3.574219 2.001583 0.268949
C  -5.191151 0.487369 1.44346
C  0.050072 -1.042456 -0.391144
C  -0.283277 -0.170741 -1.445243
C  -1.476664 -2.150122 1.420846
C  1.35482 -1.61806 -0.062084
C  3.791053 -1.442964 -0.234731
C  2.399164 0.565329 -0.225233
C  4.418479 -1.348049 1.141472
C  1.684044 1.239978 0.74207
C  3.121281 1.362108 -1.117868
C  1.728586 2.626062 0.712352
H  -3.751627 -1.468368 0.387582
H  -3.079355 0.484733 1.685296
H  -4.180016 0.40965 -1.98294
H  -4.136687 -1.353659 -2.031069
H  -5.40526 -0.532067 -1.139731
H  -3.706455 2.759139 1.043192
H  -4.294109 2.219418 -0.52207
H  -2.573934 2.131685 -0.143409
H  -5.333154 1.208287 2.249503
H  -5.36821 -0.507349 1.857101
H  -5.962568 0.68095 0.696225
H  0.365732 0.263209 -2.191329
H  -2.014182 -3.056028 1.135893
H  -0.567443 -2.452158 1.932483
H  -2.096354 -1.610925 2.137102
H  3.703911 -2.478897 -0.552335
H  4.423833 -0.951606 -0.972748
H  3.812853 -1.849498 1.895827
H  5.39983 -1.822809 1.128488
H  4.559142 -0.310929 1.44789
H  1.111451 0.731284 1.505144
H  3.715416 0.921119 -1.907942
H  1.182133 3.205082 1.444965
elementType: O N C H
totalener: -972.61291148 hartree
nucrepener: 1873.03190363 hartree
electener: -2845.64481511 hartree
oneelecener: -5039.37053295 hartree
twoeener: 2193.72571784 hartree
cpcmener: -0.04481342 hartree
kineticenergy: 968.28718525 hartree
xcener: -95.346635555226 hartree
chargesum: -0.0000000
charge: -0.533415 0.171769 -0.371315 -0.057738 -0.182308 -0.215680 0.059177 0.062453 -0.314645 -0.024729 -0.309564 -0.310496 -0.141194 -0.072719 -0.262530 0.433824 -0.041282 0.021163 -0.250539 -0.054831 -0.042138 -0.008231 0.101088 0.051043 0.094409 0.108457 0.103336 0.099340 0.087014 0.088402 0.098187 0.096712 0.087565 0.162689 0.123742 0.099755 0.116326 0.090704 0.105376 0.088169 0.101476 0.090759 0.151849 0.145503 0.153067
qa: -0.5334 0.1718 -0.3713 -0.0577 -0.1823 -0.2157 0.0592 0.0625 -0.3146 -0.0247 -0.3096 -0.3105 -0.1412 -0.0727 -0.2625 0.4338 -0.0413 0.0212 -0.2505 -0.0548 -0.0421 -0.0082 0.1011 0.0510 0.0944 0.1085 0.1033 0.0993 0.0870 0.0884 0.0982 0.0967 0.0876 0.1627 0.1237 0.0998 0.1163 0.0907 0.1054 0.0882 0.1015 0.0908 0.1518 0.1455 0.1531
va: 1.9569 3.3327 2.8920 3.0823 2.9761 2.9357 3.8375 3.8246 3.9657 3.9644 3.9341 3.9331 3.4833 4.0878 3.9691 4.0230 3.8556 3.7977 3.8983 3.8887 4.1529 4.0890 0.9935 1.0175 1.0054 1.0067 0.9991 1.0032 0.9980 1.0176 1.0037 1.0022 0.9993 1.0018 0.9918 1.0154 0.9949 1.0197 1.0008 1.0128 1.0065 1.0000 0.9999 1.0144 1.0047
dispcorr: -0.023761587 hartree
energy: -972.636673067722
dipole: -22.83995 21.47278 -1.36717 -3.33772 2.16468 -1.17304 9.40295 -7.70580 1.69715
magnitude: 2.47497 au
magnitude: 6.29089 debye
