program: Orca
programVersion: 5.0.2
elementType: O N N N N N C C C C C C C C C C C C C C C C H H H H H H H H H H H H H H H H H H H H H H H
charge: 0
multiplicity: 1
keywords: wb97x-d3
keywords: def2-TZVPP
keywords: def2/J RIJCOSX
keywords: DEFGRID2
keywords: scfconv7
keywords: smallprint printgap noloewdin
keywords: NOSOSCF
formula: C16H23N5O
InChI: InChI=1/C16H23N5O/c1-6-20(14-7-8-17-18-9-14)16(22)15-10-19-21(13(15)5)12(4)11(2)3/h7-12H,6H2,1-5H3
45 atoms
O  1.212762 -2.456486 0.976335
N  -2.011707 0.036511 -0.107038
N  -1.50301 1.141549 0.451117
N  2.441291 -0.581094 0.698489
N  2.334616 1.844242 -2.047538
N  2.970612 2.880419 -1.539786
C  -3.407157 -0.010805 -0.539819
C  -4.32193 -0.502646 0.598316
C  -3.82334 1.308537 -1.165255
C  -1.136748 -0.984763 -0.130038
C  -4.482753 0.497279 1.736492
C  -5.682324 -0.912462 0.045642
C  0.033153 -0.494902 0.438266
C  -0.268513 0.840094 0.772989
C  -1.456276 -2.311233 -0.715289
C  1.252549 -1.263525 0.698401
C  3.660208 -1.270702 1.133393
C  2.622929 0.612125 -0.017238
C  4.372914 -1.97309 -0.006644
C  3.311004 1.684845 0.502366
C  2.167733 0.751359 -1.333223
C  3.45041 2.801053 -0.312624
H  -3.441222 -0.76985 -1.323731
H  -3.851081 -1.404877 1.004366
H  -3.159886 1.5748 -1.98766
H  -4.827193 1.213597 -1.576426
H  -3.828884 2.131583 -0.454005
H  -3.528971 0.78316 2.179266
H  -5.09253 0.063434 2.530368
H  -4.98496 1.408282 1.406394
H  -6.282161 -1.383452 0.825305
H  -5.585877 -1.628145 -0.772991
H  -6.247733 -0.055468 -0.324434
H  0.358903 1.573084 1.256822
H  -2.174511 -2.856378 -0.100848
H  -1.88607 -2.212457 -1.71236
H  -0.562291 -2.920635 -0.802433
H  4.317435 -0.53348 1.59282
H  3.392616 -1.973466 1.918542
H  3.745643 -2.739342 -0.461129
H  4.672242 -1.269141 -0.784273
H  5.276121 -2.455754 0.366954
H  3.719503 1.684478 1.503645
H  1.6545 -0.061492 -1.831404
H  3.969546 3.679313 0.04765
elementType: O N C H
totalener: -972.61347539 hartree
nucrepener: 1862.07235698 hartree
electener: -2834.68583237 hartree
oneelecener: -5018.06230704 hartree
twoeener: 2183.37647467 hartree
cpcmener: -0.04530008 hartree
kineticenergy: 968.29585943 hartree
xcener: -95.348690145238 hartree
chargesum: -0.0000000
charge: -0.540959 0.175659 -0.366176 -0.053072 -0.173404 -0.219245 0.059547 0.057146 -0.310755 -0.032399 -0.311128 -0.308582 -0.143538 -0.073341 -0.256066 0.439196 -0.031804 0.027672 -0.253671 -0.124911 -0.002827 0.008198 0.097966 0.050520 0.107520 0.103872 0.093207 0.091136 0.098559 0.087955 0.097281 0.096483 0.086994 0.162378 0.120377 0.115066 0.102062 0.105011 0.090298 0.087623 0.090586 0.101594 0.159138 0.136731 0.152102
qa: -0.5410 0.1757 -0.3662 -0.0531 -0.1734 -0.2192 0.0595 0.0571 -0.3108 -0.0324 -0.3111 -0.3086 -0.1435 -0.0733 -0.2561 0.4392 -0.0318 0.0277 -0.2537 -0.1249 -0.0028 0.0082 0.0980 0.0505 0.1075 0.1039 0.0932 0.0911 0.0986 0.0880 0.0973 0.0965 0.0870 0.1624 0.1204 0.1151 0.1021 0.1050 0.0903 0.0876 0.0906 0.1016 0.1591 0.1367 0.1521
va: 1.9503 3.3387 2.8866 3.0885 2.9803 2.9411 3.8408 3.8291 3.9597 3.9612 3.9339 3.9329 3.4735 4.0883 3.9681 4.0309 3.8400 3.7800 3.8994 3.9583 4.1171 4.0826 0.9974 1.0174 1.0069 0.9994 1.0059 1.0164 1.0040 0.9971 1.0039 1.0022 0.9999 1.0009 0.9918 0.9965 1.0164 1.0011 1.0199 1.0129 1.0003 1.0067 0.9967 1.0219 1.0039
dispcorr: -0.023475477 hartree
energy: -972.636950863439
dipole: -23.48890 23.38670 -0.10220 -8.53483 7.67673 -0.85809 2.13222 -1.19296 0.93926
magnitude: 1.27631 au
magnitude: 3.24413 debye
