program: Orca
programVersion: 5.0.2
elementType: O N N N N N C C C C C C C C C C C C C C C C H H H H H H H H H H H H H H H H H H H H H H H
charge: 0
multiplicity: 1
keywords: wb97x-d3
keywords: def2-TZVPP
keywords: def2/J RIJCOSX
keywords: DEFGRID2
keywords: scfconv7
keywords: smallprint printgap noloewdin
keywords: NOSOSCF
formula: C16H23N5O
InChI: InChI=1/C16H23N5O/c1-6-20(14-7-8-17-18-9-14)16(22)15-10-19-21(13(15)5)12(4)11(2)3/h7-12H,6H2,1-5H3
45 atoms
O  1.127618 -2.5535 0.827505
N  -2.089255 -0.005376 -0.178695
N  -1.587445 1.067967 0.446662
N  2.341741 -0.650021 0.685278
N  2.251349 1.842903 -1.998895
N  2.89393 2.863325 -1.466679
C  -3.468267 0.014205 -0.661057
C  -4.499032 -0.104173 0.476449
C  -3.697589 1.2055 -1.575949
C  -1.214905 -1.02539 -0.241569
C  -4.260097 -1.351444 1.318246
C  -4.629488 1.128162 1.363772
C  -0.057084 -0.570912 0.379923
C  -0.362457 0.74468 0.779898
C  -1.503307 -2.317606 -0.914971
C  1.161073 -1.346461 0.619777
C  3.551164 -1.33053 1.159727
C  2.533192 0.558698 0.00091
C  4.357826 -1.949674 0.034809
C  3.229992 1.61387 0.544633
C  2.079132 0.734136 -1.31198
C  3.375339 2.748949 -0.24319
H  -3.575582 -0.888397 -1.263514
H  -5.453284 -0.234762 -0.045149
H  -3.033899 1.164049 -2.439706
H  -4.723055 1.185788 -1.945268
H  -3.541038 2.158161 -1.07373
H  -5.075246 -1.493005 2.029243
H  -3.33665 -1.280509 1.896672
H  -4.201957 -2.250597 0.702381
H  -5.460882 0.995342 2.058018
H  -4.831723 2.033849 0.791401
H  -3.732655 1.300819 1.957736
H  0.256391 1.448242 1.315798
H  -1.959129 -2.163756 -1.892977
H  -0.588262 -2.882831 -1.064716
H  -2.184115 -2.934399 -0.326759
H  4.154117 -0.604293 1.704161
H  3.253616 -2.083173 1.885617
H  5.242078 -2.439268 0.443214
H  3.779872 -2.697012 -0.508686
H  4.697768 -1.19537 -0.676163
H  3.641381 1.588489 1.544282
H  1.562857 -0.062506 -1.832555
H  3.900687 3.613827 0.139746
elementType: O N C H
totalener: -972.61294036 hartree
nucrepener: 1876.82555034 hartree
electener: -2849.43849070 hartree
oneelecener: -5047.66634561 hartree
twoeener: 2198.22785490 hartree
cpcmener: -0.04520967 hartree
kineticenergy: 968.29621317 hartree
xcener: -95.349007543016 hartree
chargesum: 0.0000000
charge: -0.537577 0.197495 -0.365634 -0.049172 -0.173229 -0.221317 0.069091 0.042527 -0.303997 -0.073160 -0.321614 -0.300046 -0.110917 -0.077855 -0.271202 0.439715 -0.037929 0.026790 -0.250746 -0.124798 -0.003304 0.008684 0.097977 0.043937 0.106134 0.102415 0.091512 0.104230 0.086909 0.100750 0.096683 0.095206 0.081350 0.162987 0.115086 0.103824 0.127705 0.106285 0.089897 0.100939 0.087800 0.090614 0.158081 0.135991 0.151883
qa: -0.5376 0.1975 -0.3656 -0.0492 -0.1732 -0.2213 0.0691 0.0425 -0.3040 -0.0732 -0.3216 -0.3000 -0.1109 -0.0779 -0.2712 0.4397 -0.0379 0.0268 -0.2507 -0.1248 -0.0033 0.0087 0.0980 0.0439 0.1061 0.1024 0.0915 0.1042 0.0869 0.1007 0.0967 0.0952 0.0814 0.1630 0.1151 0.1038 0.1277 0.1063 0.0899 0.1009 0.0878 0.0906 0.1581 0.1360 0.1519
va: 1.9537 3.3213 2.8751 3.0821 2.9818 2.9415 3.8410 3.8494 3.9602 3.9723 3.9427 3.9274 3.4263 4.1004 3.9655 4.0284 3.8469 3.7773 3.8994 3.9537 4.1173 4.0822 1.0016 1.0183 1.0045 1.0024 1.0087 1.0064 0.9986 1.0024 1.0056 1.0009 1.0166 1.0008 0.9955 1.0148 0.9893 1.0001 1.0203 1.0070 1.0125 1.0000 0.9972 1.0225 1.0039
dispcorr: -0.024059967 hartree
energy: -972.637000328257
dipole: -20.51565 20.35677 -0.15887 -7.83264 7.00922 -0.82342 3.02609 -2.12111 0.90498
magnitude: 1.23379 au
magnitude: 3.13605 debye
