program: Orca
programVersion: 5.0.2
elementType: O N N N N N C C C C C C C C C C C C C C C C H H H H H H H H H H H H H H H H H H H H H H H
charge: 0
multiplicity: 1
keywords: wb97x-d3
keywords: def2-TZVPP
keywords: def2/J RIJCOSX
keywords: DEFGRID2
keywords: scfconv7
keywords: smallprint printgap noloewdin
keywords: NOSOSCF
formula: C16H23N5O
InChI: InChI=1/C16H23N5O/c1-6-20(14-7-8-17-18-9-14)16(22)15-10-19-21(13(15)5)12(4)11(2)3/h7-12H,6H2,1-5H3
45 atoms
O  1.506792 -2.91112 0.466911
N  -1.872117 -0.01368 0.381262
N  -1.898145 -0.65835 1.55088
N  2.295502 -0.957818 -0.35704
N  2.743864 2.582282 -1.174076
N  2.419261 3.186623 -0.052839
C  -3.010938 0.796312 -0.047975
C  -4.045177 -0.059031 -0.804406
C  -3.567288 1.586016 1.124328
C  -0.750267 -0.253523 -0.322995
C  -4.804527 -1.032653 0.087639
C  -5.009168 0.832556 -1.579565
C  0.00745 -1.112953 0.460065
C  -0.77662 -1.33658 1.605761
C  -0.503005 0.30906 -1.67507
C  1.312494 -1.734764 0.208281
C  3.537709 -1.605441 -0.790554
C  2.320039 0.435763 -0.203591
C  4.570476 -1.70692 0.316523
C  2.014664 1.070856 0.981933
C  2.697866 1.268467 -1.262428
C  2.069465 2.45804 0.99171
H  -2.601617 1.514871 -0.761602
H  -3.48223 -0.644397 -1.540352
H  -2.794666 2.218619 1.562523
H  -4.367033 2.241667 0.781586
H  -3.968052 0.949161 1.910334
H  -4.138768 -1.670257 0.669253
H  -5.432346 -1.686644 -0.519874
H  -5.46259 -0.511584 0.785855
H  -5.665745 0.229594 -2.208662
H  -4.478887 1.528154 -2.23353
H  -5.647961 1.419177 -0.916758
H  -0.539057 -1.94412 2.466514
H  0.316794 -0.214872 -2.160859
H  -1.376671 0.204556 -2.319198
H  -0.249309 1.370346 -1.633863
H  3.287194 -2.590539 -1.178602
H  3.940139 -1.03774 -1.628676
H  5.468561 -2.196168 -0.062361
H  4.863266 -0.722502 0.684793
H  4.202014 -2.29172 1.158887
H  1.744947 0.529976 1.878691
H  2.964345 0.857829 -2.228871
H  1.829706 3.008773 1.892578
elementType: O N C H
totalener: -972.61448879 hartree
nucrepener: 1888.95247989 hartree
electener: -2861.56696868 hartree
oneelecener: -5070.88875962 hartree
twoeener: 2209.32179094 hartree
cpcmener: -0.03792659 hartree
kineticenergy: 968.29477340 hartree
xcener: -95.346969599981 hartree
chargesum: -0.0000000
charge: -0.489156 0.189848 -0.366097 -0.058372 -0.165245 -0.208393 0.056212 0.049356 -0.308771 -0.027864 -0.305560 -0.303075 -0.121739 -0.107204 -0.290343 0.409945 -0.023477 0.047004 -0.257063 -0.094554 -0.066940 -0.002185 0.097072 0.049140 0.107322 0.100746 0.096903 0.093619 0.097607 0.085325 0.096905 0.094465 0.086177 0.157305 0.114840 0.133658 0.122990 0.092584 0.100362 0.100341 0.089607 0.089422 0.145225 0.141448 0.150608
qa: -0.4892 0.1898 -0.3661 -0.0584 -0.1652 -0.2084 0.0562 0.0494 -0.3088 -0.0279 -0.3056 -0.3031 -0.1217 -0.1072 -0.2903 0.4099 -0.0235 0.0470 -0.2571 -0.0946 -0.0669 -0.0022 0.0971 0.0491 0.1073 0.1007 0.0969 0.0936 0.0976 0.0853 0.0969 0.0945 0.0862 0.1573 0.1148 0.1337 0.1230 0.0926 0.1004 0.1003 0.0896 0.0894 0.1452 0.1414 0.1506
va: 2.0133 3.3142 2.8705 3.0284 2.9841 2.9430 3.8364 3.8393 3.9620 3.9192 3.9312 3.9308 3.4836 4.1209 3.9667 4.0678 3.8450 3.7759 3.9028 3.9271 4.1507 4.0831 0.9941 1.0181 1.0068 1.0002 1.0064 1.0195 1.0040 0.9976 1.0039 1.0029 1.0012 1.0081 1.0048 0.9978 0.9881 1.0169 1.0030 1.0066 0.9997 1.0145 1.0087 1.0172 1.0048
dispcorr: -0.024789859 hartree
energy: -972.639278644985
dipole: -20.69308 20.23240 -0.46069 -0.27826 0.57252 0.29426 -4.94330 4.10115 -0.84215
magnitude: 1.00401 au
magnitude: 2.55199 debye
