program: Orca
programVersion: 5.0.2
elementType: O N N N N N C C C C C C C C C C C C C C C C H H H H H H H H H H H H H H H H H H H H H H H
charge: 0
multiplicity: 1
keywords: wb97x-d3
keywords: def2-TZVPP
keywords: def2/J RIJCOSX
keywords: DEFGRID2
keywords: scfconv7
keywords: smallprint printgap noloewdin
keywords: NOSOSCF
formula: C16H23N5O
InChI: InChI=1/C16H23N5O/c1-6-20(14-7-8-17-18-9-14)16(22)15-10-19-21(13(15)5)12(4)11(2)3/h7-12H,6H2,1-5H3
45 atoms
O  1.868254 -2.777253 -1.347561
N  -1.91976 -0.780902 -0.098555
N  -2.06157 -1.176796 -1.366205
N  2.408711 -0.827257 -0.343013
N  0.929652 2.51707 -0.616885
N  1.398437 3.128724 0.451843
C  -3.032377 -0.15841 0.617025
C  -2.986322 1.374031 0.448191
C  -4.349135 -0.80514 0.226591
C  -0.655496 -0.9042 0.348465
C  -3.297796 1.846555 -0.966125
C  -3.901503 2.052705 1.461426
C  0.070548 -1.414757 -0.717583
C  -0.873309 -1.582473 -1.745822
C  -0.248803 -0.593514 1.742595
C  1.497819 -1.734775 -0.834667
C  3.796483 -1.271188 -0.164033
C  2.089471 0.49951 -0.047035
C  3.991277 -2.155721 1.052967
C  2.615608 1.158392 1.044422
C  1.257776 1.270122 -0.87564
C  2.227851 2.477686 1.243344
H  -2.858573 -0.37189 1.67441
H  -1.959803 1.680495 0.680882
H  -4.322555 -1.879242 0.4110
H  -5.154451 -0.392782 0.833097
H  -4.602769 -0.648916 -0.819881
H  -3.13347 2.922385 -1.04485
H  -4.338408 1.658677 -1.238197
H  -2.665553 1.368345 -1.714693
H  -3.680769 1.734332 2.482553
H  -4.955316 1.843868 1.267625
H  -3.775039 3.135768 1.422467
H  -0.70956 -1.956783 -2.745514
H  -0.252624 0.479047 1.944924
H  -0.918441 -1.065704 2.463118
H  0.750471 -0.973527 1.941783
H  4.111837 -1.790192 -1.06877
H  4.418963 -0.381147 -0.090496
H  3.727294 -1.638176 1.975883
H  3.397275 -3.067397 0.992473
H  5.038823 -2.450421 1.125948
H  3.283017 0.680968 1.748776
H  0.849557 0.86503 -1.792453
H  2.597324 3.030021 2.098366
elementType: O N C H
totalener: -972.61370955 hartree
nucrepener: 1925.34061681 hartree
electener: -2897.95432636 hartree
oneelecener: -5143.99552705 hartree
twoeener: 2246.04120070 hartree
cpcmener: -0.03984520 hartree
kineticenergy: 968.28592418 hartree
xcener: -95.347445500915 hartree
chargesum: 0.0000000
charge: -0.480380 0.189582 -0.369718 -0.044677 -0.165508 -0.221690 0.063902 0.074086 -0.309761 -0.068967 -0.313169 -0.310399 -0.091469 -0.085530 -0.255571 0.360064 -0.035150 0.124338 -0.264641 -0.131973 -0.084840 -0.018465 0.096446 0.029155 0.107360 0.100331 0.096275 0.099875 0.089510 0.093914 0.094427 0.088697 0.098258 0.157613 0.114587 0.132888 0.110297 0.097771 0.104872 0.083612 0.095116 0.102430 0.159475 0.136949 0.150081
qa: -0.4804 0.1896 -0.3697 -0.0447 -0.1655 -0.2217 0.0639 0.0741 -0.3098 -0.0690 -0.3132 -0.3104 -0.0915 -0.0855 -0.2556 0.3601 -0.0351 0.1243 -0.2646 -0.1320 -0.0848 -0.0185 0.0964 0.0292 0.1074 0.1003 0.0963 0.0999 0.0895 0.0939 0.0944 0.0887 0.0983 0.1576 0.1146 0.1329 0.1103 0.0978 0.1049 0.0836 0.0951 0.1024 0.1595 0.1369 0.1501
va: 2.0227 3.3069 2.8807 3.0714 2.9580 2.9440 3.8484 3.8176 3.9612 3.9113 3.9314 3.9406 3.4561 4.1037 3.9720 4.1385 3.8265 3.7691 3.9121 3.9085 4.1436 4.0989 0.9966 1.0281 1.0076 0.9998 1.0063 1.0043 0.9991 1.0172 1.0021 1.0004 1.0033 1.0072 0.9896 1.0004 1.0006 1.0185 0.9987 1.0033 1.0073 1.0068 0.9973 1.0243 1.0050
dispcorr: -0.026379095 hartree
energy: -972.640088642452
dipole: -14.44267 15.45552 1.01285 2.64637 -2.63515 0.01122 11.92145 -9.10352 2.81792
magnitude: 2.99444 au
magnitude: 7.61126 debye
