program: Orca
programVersion: 5.0.2
elementType: O N N N N N C C C C C C C C C C C C C C C C H H H H H H H H H H H H H H H H H H H H H H H
charge: 0
multiplicity: 1
keywords: wb97x-d3
keywords: def2-TZVPP
keywords: def2/J RIJCOSX
keywords: DEFGRID2
keywords: scfconv7
keywords: smallprint printgap noloewdin
keywords: NOSOSCF
formula: C16H23N5O
InChI: InChI=1/C16H23N5O/c1-6-20(14-7-8-17-18-9-14)16(22)15-10-19-21(13(15)5)12(4)11(2)3/h7-12H,6H2,1-5H3
45 atoms
O  1.856018 -2.687758 -1.125821
N  -2.035115 -0.689831 -0.305988
N  -1.953497 -0.95716 -1.613318
N  2.255284 -0.976663 0.299132
N  2.029907 2.140661 2.204428
N  1.579851 2.998587 1.315872
C  -3.287978 -0.190184 0.252739
C  -3.542688 1.286398 -0.105002
C  -4.438427 -1.11829 -0.099923
C  -0.871672 -0.892955 0.341637
C  -2.380755 2.172663 0.326322
C  -3.896921 1.54455 -1.564561
C  0.028414 -1.314063 -0.62807
C  -0.719154 -1.348959 -1.818555
C  -0.70786 -0.746088 1.810911
C  1.436076 -1.713746 -0.522418
C  3.607926 -1.474861 0.57127
C  2.002664 0.371394 0.591747
C  4.63071 -0.987742 -0.437126
C  1.554862 1.279142 -0.344683
C  2.234409 0.881968 1.874029
C  1.350867 2.58471 0.083054
H  -3.156444 -0.223954 1.335306
H  -4.414299 1.56231 0.498961
H  -4.264065 -2.11832 0.29892
H  -5.360591 -0.74135 0.34351
H  -4.593291 -1.206444 -1.173776
H  -1.481601 1.971657 -0.260063
H  -2.131182 2.0383 1.380741
H  -2.627919 3.225854 0.182556
H  -4.180154 2.590832 -1.695243
H  -4.739947 0.941498 -1.903812
H  -3.05649 1.348865 -2.230431
H  -0.384206 -1.625958 -2.807314
H  -0.671223 0.299883 2.119337
H  -1.526886 -1.220618 2.352574
H  0.210118 -1.22817 2.138447
H  3.890633 -1.159997 1.575097
H  3.569585 -2.561626 0.590776
H  5.612713 -1.392211 -0.188926
H  4.384214 -1.308904 -1.44877
H  4.713219 0.100051 -0.432886
H  1.370813 1.009985 -1.375701
H  2.59032 0.244267 2.674038
H  0.997011 3.33777 -0.609645
elementType: O N C H
totalener: -972.61423889 hartree
nucrepener: 1927.30101652 hartree
electener: -2899.91525541 hartree
oneelecener: -5147.62457022 hartree
twoeener: 2247.70931481 hartree
cpcmener: -0.03816585 hartree
kineticenergy: 968.29676739 hartree
xcener: -95.348760275655 hartree
chargesum: 0.0000000
charge: -0.490773 0.197097 -0.368682 -0.055189 -0.171160 -0.197169 0.063038 0.056847 -0.305569 -0.075065 -0.329702 -0.298602 -0.076335 -0.104817 -0.281585 0.402765 -0.025452 0.053770 -0.256462 -0.086620 -0.058058 -0.043071 0.097414 0.044882 0.105723 0.100855 0.094660 0.079275 0.104168 0.108382 0.095370 0.094923 0.083325 0.156991 0.120822 0.131389 0.115816 0.100297 0.092497 0.100570 0.089023 0.090207 0.145570 0.142155 0.156479
qa: -0.4908 0.1971 -0.3687 -0.0552 -0.1712 -0.1972 0.0630 0.0568 -0.3056 -0.0751 -0.3297 -0.2986 -0.0763 -0.1048 -0.2816 0.4028 -0.0255 0.0538 -0.2565 -0.0866 -0.0581 -0.0431 0.0974 0.0449 0.1057 0.1009 0.0947 0.0793 0.1042 0.1084 0.0954 0.0949 0.0833 0.1570 0.1208 0.1314 0.1158 0.1003 0.0925 0.1006 0.0890 0.0902 0.1456 0.1422 0.1565
va: 2.0131 3.3095 2.8690 3.0273 2.9893 2.9250 3.8498 3.8420 3.9586 3.9381 3.9485 3.9290 3.4071 4.1310 3.9611 4.0793 3.8477 3.7593 3.9033 3.9126 4.1362 4.0796 1.0013 1.0187 1.0045 1.0025 1.0088 0.9995 1.0016 1.0071 1.0055 1.0015 1.0174 1.0084 0.9881 0.9978 1.0052 1.0029 1.0180 1.0064 1.0139 0.9994 1.0079 1.0170 1.0032
dispcorr: -0.026881057 hartree
energy: -972.641119950136
dipole: -14.59755 14.05268 -0.54487 3.60623 -3.52363 0.08260 0.27195 0.56584 0.83779
magnitude: 1.00279 au
magnitude: 2.54890 debye
