program: Orca
programVersion: 5.0.2
elementType: O N N N N N C C C C C C C C C C C C C C C C H H H H H H H H H H H H H H H H H H H H H H H
charge: 0
multiplicity: 1
keywords: wb97x-d3
keywords: def2-TZVPP
keywords: def2/J RIJCOSX
keywords: DEFGRID2
keywords: scfconv7
keywords: smallprint printgap noloewdin
keywords: NOSOSCF
formula: C16H23N5O
InChI: InChI=1/C16H23N5O/c1-6-20(14-7-8-17-18-9-14)16(22)15-10-19-21(13(15)5)12(4)11(2)3/h7-12H,6H2,1-5H3
45 atoms
O  1.564969 -2.81177 1.045743
N  -1.832804 -0.034823 0.337966
N  -1.955426 -0.515773 1.577082
N  2.421441 -0.90794 0.181509
N  1.742808 2.595023 1.015712
N  2.235121 3.240533 -0.021523
C  -2.929989 0.73973 -0.232688
C  -4.216191 -0.097992 -0.268729
C  -3.06148 2.056626 0.520148
C  -0.646515 -0.327421 -0.223762
C  -5.354487 0.688929 -0.909068
C  -3.999722 -1.410758 -1.014303
C  0.048686 -1.055931 0.731898
C  -0.83533 -1.153387 1.820709
C  -0.280344 0.052332 -1.611867
C  1.383434 -1.663471 0.677741
C  3.660522 -1.59811 -0.194841
C  2.371291 0.483196 0.075986
C  3.558573 -2.328472 -1.521106
C  2.924957 1.165365 -0.98728
C  1.809226 1.283567 1.083091
C  2.821897 2.550986 -0.98019
H  -2.640446 0.958197 -1.263014
H  -4.497908 -0.326519 0.764309
H  -3.737878 2.733108 0.00019
H  -3.443216 1.904815 1.530552
H  -2.094499 2.556525 0.591476
H  -6.247242 0.066673 -0.988192
H  -5.094492 1.017859 -1.918535
H  -5.631014 1.571216 -0.331662
H  -3.246023 -2.042478 -0.542234
H  -3.689442 -1.234103 -2.047484
H  -4.924765 -1.988705 -1.04667
H  -0.669151 -1.640187 2.770377
H  0.617539 -0.474465 -1.926633
H  -1.068851 -0.212398 -2.317287
H  -0.096432 1.123924 -1.70739
H  4.455065 -0.85438 -0.228103
H  3.924139 -2.291009 0.603584
H  3.346721 -1.64544 -2.344337
H  4.504309 -2.826678 -1.737601
H  2.781062 -3.09197 -1.504683
H  3.402194 0.663582 -1.818004
H  1.409546 0.844794 1.988192
H  3.222871 3.131139 -1.80194
elementType: O N C H
totalener: -972.61601400 hartree
nucrepener: 1901.08290051 hartree
electener: -2873.69891450 hartree
oneelecener: -5095.37535855 hartree
twoeener: 2221.67644404 hartree
cpcmener: -0.04008506 hartree
kineticenergy: 968.28924604 hartree
xcener: -95.346091655594 hartree
chargesum: -0.0000000
charge: -0.478294 0.235055 -0.355520 -0.044846 -0.164663 -0.219284 0.005744 0.074553 -0.294489 -0.103004 -0.301524 -0.302119 -0.036351 -0.131140 -0.280934 0.372940 -0.037048 0.122490 -0.264999 -0.138336 -0.080822 -0.017241 0.090971 0.044531 0.101229 0.097640 0.098590 0.092070 0.088250 0.096576 0.093464 0.084169 0.099086 0.159274 0.108127 0.130969 0.125304 0.105182 0.097884 0.084278 0.102887 0.095528 0.159356 0.134580 0.149883
qa: -0.4783 0.2351 -0.3555 -0.0448 -0.1647 -0.2193 0.0057 0.0746 -0.2945 -0.1030 -0.3015 -0.3021 -0.0364 -0.1311 -0.2809 0.3729 -0.0370 0.1225 -0.2650 -0.1383 -0.0808 -0.0172 0.0910 0.0445 0.1012 0.0976 0.0986 0.0921 0.0882 0.0966 0.0935 0.0842 0.0991 0.1593 0.1081 0.1310 0.1253 0.1052 0.0979 0.0843 0.1029 0.0955 0.1594 0.1346 0.1499
va: 2.0251 3.2623 2.8668 3.0631 2.9690 2.9503 3.8832 3.7815 3.9611 3.9346 3.9453 3.9336 3.3659 4.1605 3.9812 4.1169 3.8250 3.7656 3.9125 3.9129 4.1601 4.1044 1.0063 1.0357 1.0007 1.0070 1.0101 1.0052 0.9997 1.0014 1.0059 1.0040 1.0061 1.0089 1.0021 0.9977 0.9863 0.9989 1.0195 1.0031 1.0072 1.0062 0.9974 1.0251 1.0054
dispcorr: -0.025363078 hartree
energy: -972.641377074493
dipole: -18.83004 19.44928 0.61924 -2.43937 2.43793 -0.00143 -14.88511 11.91937 -2.96574
magnitude: 3.02970 au
magnitude: 7.70088 debye
