program: Orca
programVersion: 5.0.2
elementType: O N N N N N C C C C C C C C C C C C C C C C H H H H H H H H H H H H H H H H H H H H H H H
charge: 0
multiplicity: 1
keywords: wb97x-d3
keywords: def2-TZVPP
keywords: def2/J RIJCOSX
keywords: DEFGRID2
keywords: scfconv7
keywords: smallprint printgap noloewdin
keywords: NOSOSCF
formula: C16H23N5O
InChI: InChI=1/C16H23N5O/c1-6-20(14-7-8-17-18-9-14)16(22)15-10-19-21(13(15)5)12(4)11(2)3/h7-12H,6H2,1-5H3
45 atoms
O  1.445536 -2.809305 0.567593
N  -2.081661 -0.666537 -0.442806
N  -1.478377 0.017429 -1.420508
N  2.418088 -0.800296 0.213523
N  1.259205 2.550333 1.121885
N  2.017046 3.332685 0.380899
C  -3.52479 -0.549861 -0.265094
C  -3.938218 0.829761 0.283162
C  -4.250184 -0.950135 -1.539923
C  -1.216014 -1.361371 0.317972
C  -3.157745 1.191276 1.541972
C  -3.876439 1.970373 -0.725998
C  0.043385 -1.077743 -0.191647
C  -0.196518 -0.209633 -1.274898
C  -1.622795 -2.202334 1.4727
C  1.323866 -1.637991 0.24908
C  3.754209 -1.405122 0.196691
C  2.308668 0.589999 0.229454
C  4.129497 -1.976573 -1.15818
C  3.128928 1.413059 -0.512938
C  1.391397 1.244148 1.068088
C  2.929848 2.783458 -0.396331
H  -3.780509 -1.279919 0.504445
H  -4.988062 0.700871 0.569136
H  -5.327592 -0.879624 -1.388183
H  -3.98692 -0.31734 -2.385602
H  -4.020664 -1.982424 -1.806617
H  -2.108623 1.403971 1.322873
H  -3.191666 0.395985 2.289095
H  -3.574846 2.087078 2.004768
H  -4.291515 2.876634 -0.281426
H  -4.455674 1.763391 -1.626465
H  -2.853847 2.192629 -1.029414
H  0.517216 0.22222 -1.960906
H  -2.105172 -1.610209 2.251023
H  -2.3213 -2.984768 1.172437
H  -0.757403 -2.687456 1.914959
H  4.467244 -0.640191 0.499829
H  3.792585 -2.179347 0.962292
H  4.12735 -1.209145 -1.933061
H  5.132116 -2.403024 -1.113094
H  3.447714 -2.769523 -1.465719
H  3.889412 1.032798 -1.181429
H  0.749776 0.682643 1.735431
H  3.536091 3.472105 -0.971599
elementType: O N C H
totalener: -972.61469303 hartree
nucrepener: 1897.14839654 hartree
electener: -2869.76308957 hartree
oneelecener: -5088.23484109 hartree
twoeener: 2218.47175153 hartree
cpcmener: -0.03759016 hartree
kineticenergy: 968.29280808 hartree
xcener: -95.347735247042 hartree
chargesum: -0.0000000
charge: -0.483818 0.193309 -0.366235 -0.049333 -0.172240 -0.224069 0.058374 0.049334 -0.307400 -0.071410 -0.315981 -0.295457 -0.090337 -0.062336 -0.260944 0.362631 -0.040869 0.103278 -0.252454 -0.148832 -0.034709 -0.007981 0.097434 0.044992 0.101795 0.094744 0.104624 0.075027 0.103151 0.105666 0.094955 0.092513 0.084988 0.160524 0.120476 0.118749 0.101479 0.103644 0.095188 0.084062 0.097744 0.092022 0.158285 0.136563 0.148851
qa: -0.4838 0.1933 -0.3662 -0.0493 -0.1722 -0.2241 0.0584 0.0493 -0.3074 -0.0714 -0.3160 -0.2955 -0.0903 -0.0623 -0.2609 0.3626 -0.0409 0.1033 -0.2525 -0.1488 -0.0347 -0.0080 0.0974 0.0450 0.1018 0.0947 0.1046 0.0750 0.1032 0.1057 0.0950 0.0925 0.0850 0.1605 0.1205 0.1187 0.1015 0.1036 0.0952 0.0841 0.0977 0.0920 0.1583 0.1366 0.1489
va: 2.0153 3.3146 2.8793 3.0904 2.9608 2.9579 3.8559 3.8329 3.9650 3.9746 3.9557 3.9264 3.3879 4.0782 3.9556 4.0984 3.8342 3.8019 3.9174 3.9224 4.1016 4.1050 0.9998 1.0180 1.0020 1.0072 1.0052 1.0000 1.0016 1.0065 1.0054 1.0010 1.0186 1.0007 0.9915 0.9937 1.0214 0.9993 1.0199 1.0045 1.0064 1.0066 0.9953 1.0174 1.0044
dispcorr: -0.024750133 hartree
energy: -972.639443158800
dipole: -17.05717 17.30554 0.24837 -3.64675 2.50512 -1.14163 -1.54799 1.32572 -0.22226
magnitude: 1.18929 au
magnitude: 3.02294 debye
