program: Orca
programVersion: 5.0.2
elementType: O N N N N N C C C C C C C C C C C C C C C C H H H H H H H H H H H H H H H H H H H H H H H
charge: 0
multiplicity: 1
keywords: wb97x-d3
keywords: def2-TZVPP
keywords: def2/J RIJCOSX
keywords: DEFGRID2
keywords: scfconv7
keywords: smallprint printgap noloewdin
keywords: NOSOSCF
formula: C16H23N5O
InChI: InChI=1/C16H23N5O/c1-6-20(14-7-8-17-18-9-14)16(22)15-10-19-21(13(15)5)12(4)11(2)3/h7-12H,6H2,1-5H3
45 atoms
O  1.207968 -2.539312 0.828767
N  -2.072101 -0.051775 -0.130878
N  -1.611746 1.006474 0.544176
N  2.367833 -0.598921 0.737514
N  3.340614 2.869144 0.086688
N  2.934207 3.059897 -1.148859
C  -3.44111 -0.020254 -0.635544
C  -4.434867 0.099625 0.529736
C  -3.572349 1.077415 -1.680972
C  -1.169913 -1.042155 -0.229888
C  -5.871702 0.070294 0.019738
C  -4.219531 -1.006113 1.557425
C  -0.031433 -0.580995 0.421462
C  -0.380556 0.70626 0.876032
C  -1.431142 -2.319524 -0.941574
C  1.20666 -1.331118 0.649767
C  3.585593 -1.252289 1.225842
C  2.528799 0.619596 0.062533
C  4.411587 -1.87446 0.115551
C  2.125828 0.813706 -1.241631
C  3.151161 1.708283 0.680801
C  2.346263 2.068202 -1.793446
H  -3.606434 -0.985026 -1.120133
H  -4.265573 1.065179 1.017631
H  -2.795808 0.98008 -2.440784
H  -4.532298 1.011813 -2.190561
H  -3.491222 2.069178 -1.234707
H  -6.571107 0.100725 0.856609
H  -6.076287 -0.843463 -0.544128
H  -6.106337 0.919039 -0.622605
H  -4.944157 -0.918649 2.368648
H  -3.22841 -0.970945 2.011594
H  -4.348951 -1.99507 1.110227
H  0.212533 1.401899 1.451137
H  -0.506254 -2.867945 -1.096692
H  -2.103944 -2.963516 -0.372449
H  -1.883092 -2.149917 -1.918832
H  4.176534 -0.509244 1.761474
H  3.295692 -2.000805 1.96009
H  5.301572 -2.342134 0.53832
H  3.852795 -2.6421 -0.419688
H  4.745591 -1.126799 -0.605518
H  1.658116 0.033108 -1.826035
H  3.501681 1.644155 1.703938
H  2.045158 2.280015 -2.811658
elementType: O N C H
totalener: -972.61762416 hartree
nucrepener: 1864.78725428 hartree
electener: -2837.40487844 hartree
oneelecener: -5023.07093273 hartree
twoeener: 2185.66605429 hartree
cpcmener: -0.03701941 hartree
kineticenergy: 968.28855232 hartree
xcener: -95.343766715014 hartree
chargesum: 0.0000000
charge: -0.498151 0.211465 -0.355872 -0.058972 -0.172525 -0.206256 0.008263 0.067438 -0.293774 -0.072079 -0.303238 -0.301858 -0.078548 -0.099857 -0.273410 0.412662 -0.032757 0.016563 -0.251593 -0.065467 -0.048356 -0.003089 0.089896 0.045857 0.101468 0.100102 0.098045 0.092698 0.088737 0.097228 0.099662 0.092989 0.085145 0.158147 0.103285 0.123380 0.113595 0.101119 0.090506 0.099444 0.088084 0.088921 0.148920 0.142762 0.149424
qa: -0.4982 0.2115 -0.3559 -0.0590 -0.1725 -0.2063 0.0083 0.0674 -0.2938 -0.0721 -0.3032 -0.3019 -0.0785 -0.0999 -0.2734 0.4127 -0.0328 0.0166 -0.2516 -0.0655 -0.0484 -0.0031 0.0899 0.0459 0.1015 0.1001 0.0980 0.0927 0.0887 0.0972 0.0997 0.0930 0.0851 0.1581 0.1033 0.1234 0.1136 0.1011 0.0905 0.0994 0.0881 0.0889 0.1489 0.1428 0.1494
va: 2.0023 3.2837 2.8823 3.0670 2.9800 2.9396 3.8824 3.7945 3.9591 3.9658 3.9439 3.9356 3.4036 4.1329 3.9748 4.0537 3.8506 3.7932 3.8966 3.8979 4.1582 4.0889 1.0067 1.0340 1.0067 1.0016 1.0075 1.0053 0.9996 1.0010 1.0063 1.0048 1.0035 1.0052 1.0148 0.9900 0.9950 1.0011 1.0191 1.0072 1.0132 1.0006 1.0021 1.0142 1.0051
dispcorr: -0.023619177 hartree
energy: -972.641243333435
dipole: -24.07323 22.85862 -1.21461 -10.81366 9.10529 -1.70837 -2.79545 1.73752 -1.05793
magnitude: 2.34798 au
magnitude: 5.96808 debye
